BDBM50412644 CHEMBL465456
SMILES: Oc1ccc(cc1-n1nncc1-c1ccccc1)[N+]([O-])=O
InChI Key: InChIKey=ANUIERZLOCVFPT-UHFFFAOYSA-N
Data: 1 IC50
Activity Spreadsheet -- Enzyme Inhibition Constant Data from BindingDB
Found 1 hit for monomerid = 50412644
Trg + Lig
Ki
nM
ΔG°
kcal/mole
IC50
nM
Kd
nM
EC50/IC50
nM
koff
s-1
kon
M-1s-1
pHTemp
°C
Calcium-activated potassium channel subunit alpha-1
(Homo sapiens (Human))
BDBM50412644
(CHEMBL465456)
Show SMILES Oc1ccc(cc1-n1nncc1-c1ccccc1)[N+]([O-])=O
Show InChI InChI=1S/C14H10N4O3/c19-14-7-6-11(18(20)21)8-12(14)17-13(9-15-16-17)10-4-2-1-3-5-10/h1-9,19H
Reactome pathway
n/an/a 2.63E+3n/an/an/an/an/an/a
Universit£ di Pisa
Curated by ChEMBL
Assay Description
Activation of BK channel-mediated vasorelaxation activity assessed as reduction in KCl-induced contractile tone
Bioorg Med Chem 17: 319-25 (2008)
Article DOI: 10.1016/j.bmc.2008.10.068
BindingDB Entry DOI: 10.7270/Q2P84D59