BDBM50412657 CHEMBL480415
SMILES: Cc1ccc(O)c(NC(=O)c2ccc(F)cc2)c1
InChI Key: InChIKey=SZDWHPJCJMDNIW-UHFFFAOYSA-N
Data: 1 IC50
Activity Spreadsheet -- Enzyme Inhibition Constant Data from BindingDB
Found 1 hit for monomerid = 50412657
Trg + Lig
Ki
nM
ΔG°
kcal/mole
IC50
nM
Kd
nM
EC50/IC50
nM
koff
s-1
kon
M-1s-1
pHTemp
°C
Calcium-activated potassium channel alpha/beta 1
(Homo sapiens (Human))
BDBM50412657
(CHEMBL480415)
Show SMILES Cc1ccc(O)c(NC(=O)c2ccc(F)cc2)c1
Show InChI InChI=1S/C14H12FNO2/c1-9-2-7-13(17)12(8-9)16-14(18)10-3-5-11(15)6-4-10/h2-8,17H,1H3,(H,16,18)
Reactome pathway
n/an/a 1.12E+4n/an/an/an/an/an/a
Universit£ di Pisa
Curated by ChEMBL
Assay Description
Activation of BK channel-mediated vasorelaxation activity assessed as reduction in KCl-induced contractile tone
Bioorg Med Chem 17: 319-25 (2008)
Article DOI: 10.1016/j.bmc.2008.10.068
BindingDB Entry DOI: 10.7270/Q2P84D59