null
SMILES: Oc1ccc(Cl)cc1NC(=O)c1ccco1
InChI Key: InChIKey=HKJDMLBNEXKOJI-UHFFFAOYSA-N
Activity Spreadsheet -- Enzyme Inhibition Constant Data from BindingDB
Found 1 hit for monomerid = 50412662
Trg + Lig
Ki
nM
ΔG°
kcal/mole
IC50
nM
Kd
nM
EC50/IC50
nM
koff
s-1
kon
M-1s-1
pHTemp
°C
Calcium-activated potassium channel subunit alpha-1
(Homo sapiens (Human))
BDBM50412662
(CHEMBL463882)
Show SMILES Oc1ccc(Cl)cc1NC(=O)c1ccco1
Show InChI InChI=1S/C11H8ClNO3/c12-7-3-4-9(14)8(6-7)13-11(15)10-2-1-5-16-10/h1-6,14H,(H,13,15)
Reactome pathway
n/an/a 1.51E+4n/an/an/an/an/an/a
Universit£ di Pisa
Curated by ChEMBL
Assay Description
Activation of BK channel-mediated vasorelaxation activity assessed as reduction in KCl-induced contractile tone
Bioorg Med Chem 17: 319-25 (2008)
Article DOI: 10.1016/j.bmc.2008.10.068
BindingDB Entry DOI: 10.7270/Q2P84D59