BDBM50412686 CHEMBL467450
SMILES: CCCCCCCCCCCCS(=O)(=O)CC(O)(O)C(F)(F)F
InChI Key: InChIKey=PRMXHUVVMHMYJP-UHFFFAOYSA-N
Data: 2 KI  3 IC50
Activity Spreadsheet -- Enzyme Inhibition Constant Data from BindingDB
Found 5 hits for monomerid = 50412686
Trg + Lig
Ki
nM
ΔG°
kcal/mole
IC50
nM
Kd
nM
EC50/IC50
nM
koff
s-1
kon
M-1s-1
pHTemp
°C
Acyl-CoA: cholesterol acyltransferase (ACAT)
(Homo sapiens (Human))
BDBM50412686
(CHEMBL467450)
Show SMILES CCCCCCCCCCCCS(=O)(=O)CC(O)(O)C(F)(F)F
Show InChI InChI=1S/C15H29F3O4S/c1-2-3-4-5-6-7-8-9-10-11-12-23(21,22)13-14(19,20)15(16,17)18/h19-20H,2-13H2,1H3
0.398n/an/an/an/an/an/an/an/a
Kyoto University
Curated by ChEMBL
Assay Description
Inhibition of human carboxylesterase 1 after 24 hrs
Bioorg Med Chem 17: 149-64 (2008)
Article DOI: 10.1016/j.bmc.2008.11.008
BindingDB Entry DOI: 10.7270/Q2JH3NFK
Acyl-CoA: cholesterol acyltransferase (ACAT)
(Homo sapiens (Human))
BDBM50412686
(CHEMBL467450)
Show SMILES CCCCCCCCCCCCS(=O)(=O)CC(O)(O)C(F)(F)F
Show InChI InChI=1S/C15H29F3O4S/c1-2-3-4-5-6-7-8-9-10-11-12-23(21,22)13-14(19,20)15(16,17)18/h19-20H,2-13H2,1H3
741n/an/an/an/an/an/an/an/a
Kyoto University
Curated by ChEMBL
Assay Description
Inhibition of human carboxylesterase 1 after 5 mins
Bioorg Med Chem 17: 149-64 (2008)
Article DOI: 10.1016/j.bmc.2008.11.008
BindingDB Entry DOI: 10.7270/Q2JH3NFK
Carboxylesterase
(Sus scrofa)
BDBM50412686
(CHEMBL467450)
Show SMILES CCCCCCCCCCCCS(=O)(=O)CC(O)(O)C(F)(F)F
Show InChI InChI=1S/C15H29F3O4S/c1-2-3-4-5-6-7-8-9-10-11-12-23(21,22)13-14(19,20)15(16,17)18/h19-20H,2-13H2,1H3
n/an/a 473n/an/an/an/an/an/a
University of California at Davis
Curated by ChEMBL
Assay Description
Inhibition of Sus scrofa (pig) carboxylesterase isolated from liver in using p-nitrophenyl acetate as substrate incubated for 5 min prior to substrat...
Chem Res Toxicol 14: 1563-72 (2001)
Article DOI: 10.1021/tx015508+
BindingDB Entry DOI: 10.7270/Q20004ZT
Liver carboxylesterase B-1
(Rattus norvegicus)
BDBM50412686
(CHEMBL467450)
Show SMILES CCCCCCCCCCCCS(=O)(=O)CC(O)(O)C(F)(F)F
Show InChI InChI=1S/C15H29F3O4S/c1-2-3-4-5-6-7-8-9-10-11-12-23(21,22)13-14(19,20)15(16,17)18/h19-20H,2-13H2,1H3
n/an/a 10n/an/an/an/an/an/a
University of California at Davis
Curated by ChEMBL
Assay Description
Inhibition of carboxylesterase in Fischer 344 Rattus norvegicus (rat) liver microsomes using p-nitrophenyl acetate as substrate incubated for 5 min p...
Chem Res Toxicol 14: 1563-72 (2001)
Article DOI: 10.1021/tx015508+
BindingDB Entry DOI: 10.7270/Q20004ZT
Juvenile hormone esterase
(Trichoplusia ni)
BDBM50412686
(CHEMBL467450)
Show SMILES CCCCCCCCCCCCS(=O)(=O)CC(O)(O)C(F)(F)F
Show InChI InChI=1S/C15H29F3O4S/c1-2-3-4-5-6-7-8-9-10-11-12-23(21,22)13-14(19,20)15(16,17)18/h19-20H,2-13H2,1H3
n/an/a 191n/an/an/an/an/an/a
University of California at Davis
Curated by ChEMBL
Assay Description
Inhibition of Trichoplusia ni (cabbage looper) juvenile hormone esterase isolated from fifth-intsar larval stage using [3H]JH 3 as substrate incubate...
Chem Res Toxicol 14: 1563-72 (2001)
Article DOI: 10.1021/tx015508+
BindingDB Entry DOI: 10.7270/Q20004ZT