BDBM50413005 CHEMBL476627
SMILES: CNCCNc1cnn(Cc2cccc(NC(=O)c3ccc(cc3)-c3ccc(OC)nc3)c2C)c(=O)c1Cl
InChI Key: InChIKey=OGSTUOJFXIAEAY-UHFFFAOYSA-N
Data: 1 EC50
Activity Spreadsheet -- Enzyme Inhibition Constant Data from BindingDB
Found 1 hit for monomerid = 50413005
Trg + Lig
Ki
nM
ΔG°
kcal/mole
IC50
nM
Kd
nM
EC50/IC50
nM
koff
s-1
kon
M-1s-1
pHTemp
°C
Mas-related G-protein coupled receptor member X1
(Homo sapiens (Human))
BDBM50413005
(CHEMBL476627)
Show SMILES CNCCNc1cnn(Cc2cccc(NC(=O)c3ccc(cc3)-c3ccc(OC)nc3)c2C)c(=O)c1Cl
Show InChI InChI=1S/C28H29ClN6O3/c1-18-22(17-35-28(37)26(29)24(16-33-35)31-14-13-30-2)5-4-6-23(18)34-27(36)20-9-7-19(8-10-20)21-11-12-25(38-3)32-15-21/h4-12,15-16,30-31H,13-14,17H2,1-3H3,(H,34,36)
n/an/an/an/a 295n/an/an/an/a
GlaxoSmithKline Pharmaceuticals
Curated by ChEMBL
Assay Description
Agonist activity at human MrgX1 receptor expressed in HEK293 cells assessed as intracellular calcium mobilization by FLIPR assay
J Med Chem 52: 818-25 (2009)
Article DOI: 10.1021/jm800962k
BindingDB Entry DOI: 10.7270/Q2R212MD