BDBM50413006 CHEMBL450183
SMILES: COc1ccc(cn1)-c1ccc(cc1)C(=O)Nc1cccc(Cn2ncc(N3CC(C)NC(C)C3)c(Cl)c2=O)c1C
InChI Key: InChIKey=PIJVLUXGTSNNFE-UHFFFAOYSA-N
Data: 1 EC50
Activity Spreadsheet -- Enzyme Inhibition Constant Data from BindingDB
Found 1 hit for monomerid = 50413006
Trg + Lig
Ki
nM
ΔG°
kcal/mole
IC50
nM
Kd
nM
EC50/IC50
nM
koff
s-1
kon
M-1s-1
pHTemp
°C
Mas-related G-protein coupled receptor member X1
(Homo sapiens (Human))
BDBM50413006
(CHEMBL450183)
Show SMILES COc1ccc(cn1)-c1ccc(cc1)C(=O)Nc1cccc(Cn2ncc(N3CC(C)NC(C)C3)c(Cl)c2=O)c1C
Show InChI InChI=1S/C31H33ClN6O3/c1-19-16-37(17-20(2)35-19)27-15-34-38(31(40)29(27)32)18-25-6-5-7-26(21(25)3)36-30(39)23-10-8-22(9-11-23)24-12-13-28(41-4)33-14-24/h5-15,19-20,35H,16-18H2,1-4H3,(H,36,39)
n/an/an/an/a 5.75E+3n/an/an/an/a
GlaxoSmithKline Pharmaceuticals
Curated by ChEMBL
Assay Description
Agonist activity at human MrgX1 receptor expressed in HEK293 cells assessed as intracellular calcium mobilization by FLIPR assay
J Med Chem 52: 818-25 (2009)
Article DOI: 10.1021/jm800962k
BindingDB Entry DOI: 10.7270/Q2R212MD