BDBM50413106 CHEMBL538360
SMILES: CC(C)OC(=O)c1ccc(NC(=O)N[C@@H](Cc2ccc(O)cc2)C(=O)N[C@H]2CCC[N+]3(C2)CCCCCC3)cc1
InChI Key: InChIKey=CZJGXFZAKXFGFE-XCZPVHLTSA-O
Data: 3 Kd
Activity Spreadsheet -- Enzyme Inhibition Constant Data from BindingDB
Found 3 hits for monomerid = 50413106
Trg + Lig
Ki
nM
ΔG°
kcal/mole
IC50
nM
Kd
nM
EC50/IC50
nM
koff
s-1
kon
M-1s-1
pHTemp
°C
Muscarinic acetylcholine receptor M2
(Homo sapiens (Human))
BDBM50413106
(CHEMBL538360)
Show SMILES CC(C)OC(=O)c1ccc(NC(=O)N[C@@H](Cc2ccc(O)cc2)C(=O)N[C@H]2CCC[N+]3(C2)CCCCCC3)cc1 |r|
Show InChI InChI=1S/C31H42N4O5/c1-22(2)40-30(38)24-11-13-25(14-12-24)33-31(39)34-28(20-23-9-15-27(36)16-10-23)29(37)32-26-8-7-19-35(21-26)17-5-3-4-6-18-35/h9-16,22,26,28H,3-8,17-21H2,1-2H3,(H3-,32,33,34,36,37,38,39)/p+1/t26-,28-/m0/s1
n/an/an/a 5.01n/an/an/an/an/a
GlaxoSmithKline
Curated by ChEMBL
Assay Description
Antagonist activity at human recombinant muscarinic M2 receptor expressed in CHO cells coexpressing chimeric G protein Gqi5 assessed as inhibition of...
Bioorg Med Chem Lett 18: 5481-6 (2008)
Article DOI: 10.1016/j.bmcl.2008.09.020
BindingDB Entry DOI: 10.7270/Q23B61CM
Muscarinic acetylcholine receptor M1
(Homo sapiens (Human))
BDBM50413106
(CHEMBL538360)
Show SMILES CC(C)OC(=O)c1ccc(NC(=O)N[C@@H](Cc2ccc(O)cc2)C(=O)N[C@H]2CCC[N+]3(C2)CCCCCC3)cc1 |r|
Show InChI InChI=1S/C31H42N4O5/c1-22(2)40-30(38)24-11-13-25(14-12-24)33-31(39)34-28(20-23-9-15-27(36)16-10-23)29(37)32-26-8-7-19-35(21-26)17-5-3-4-6-18-35/h9-16,22,26,28H,3-8,17-21H2,1-2H3,(H3-,32,33,34,36,37,38,39)/p+1/t26-,28-/m0/s1
n/an/an/a 79.4n/an/an/an/an/a
GlaxoSmithKline
Curated by ChEMBL
Assay Description
Antagonist activity at human recombinant muscarinic M1 receptor expressed in CHO cells assessed as inhibition of acetylcholine-induced intracellular ...
Bioorg Med Chem Lett 18: 5481-6 (2008)
Article DOI: 10.1016/j.bmcl.2008.09.020
BindingDB Entry DOI: 10.7270/Q23B61CM
Muscarinic acetylcholine receptor M3
(Homo sapiens (Human))
BDBM50413106
(CHEMBL538360)
Show SMILES CC(C)OC(=O)c1ccc(NC(=O)N[C@@H](Cc2ccc(O)cc2)C(=O)N[C@H]2CCC[N+]3(C2)CCCCCC3)cc1 |r|
Show InChI InChI=1S/C31H42N4O5/c1-22(2)40-30(38)24-11-13-25(14-12-24)33-31(39)34-28(20-23-9-15-27(36)16-10-23)29(37)32-26-8-7-19-35(21-26)17-5-3-4-6-18-35/h9-16,22,26,28H,3-8,17-21H2,1-2H3,(H3-,32,33,34,36,37,38,39)/p+1/t26-,28-/m0/s1
Reactome pathway
n/an/an/a 3.16n/an/an/an/an/a
GlaxoSmithKline
Curated by ChEMBL
Assay Description
Antagonist activity at human recombinant muscarinic M3 receptor expressed in CHO cells assessed as inhibition of acetylcholine-induced intracellular ...
Bioorg Med Chem Lett 18: 5481-6 (2008)
Article DOI: 10.1016/j.bmcl.2008.09.020
BindingDB Entry DOI: 10.7270/Q23B61CM