BDBM50413111 CHEMBL540401
SMILES: Cc1nc(no1)-c1ccc(NC(=O)N[C@@H](Cc2ccc(O)cc2)C(=O)N[C@H]2CCC[N+](C)(Cc3ccc(O)cc3)C2)cc1
InChI Key: InChIKey=YQUMEJDEWPVTIF-YMGYHPDWSA-O
Data: 3 Kd
Activity Spreadsheet -- Enzyme Inhibition Constant Data from BindingDB
Found 3 hits for monomerid = 50413111
Trg + Lig
Ki
nM
ΔG°
kcal/mole
IC50
nM
Kd
nM
EC50/IC50
nM
koff
s-1
kon
M-1s-1
pHTemp
°C
Muscarinic acetylcholine receptor M2
(Homo sapiens (Human))
BDBM50413111
(CHEMBL540401)
Show SMILES Cc1nc(no1)-c1ccc(NC(=O)N[C@@H](Cc2ccc(O)cc2)C(=O)N[C@H]2CCC[N+](C)(Cc3ccc(O)cc3)C2)cc1 |r|
Show InChI InChI=1S/C32H36N6O5/c1-21-33-30(37-43-21)24-9-11-25(12-10-24)35-32(42)36-29(18-22-5-13-27(39)14-6-22)31(41)34-26-4-3-17-38(2,20-26)19-23-7-15-28(40)16-8-23/h5-16,26,29H,3-4,17-20H2,1-2H3,(H4-,34,35,36,37,39,40,41,42)/p+1/t26-,29-,38?/m0/s1
n/an/an/a 6.31n/an/an/an/an/a
GlaxoSmithKline
Curated by ChEMBL
Assay Description
Antagonist activity at human recombinant muscarinic M2 receptor expressed in CHO cells coexpressing chimeric G protein Gqi5 assessed as inhibition of...
Bioorg Med Chem Lett 18: 5481-6 (2008)
Article DOI: 10.1016/j.bmcl.2008.09.020
BindingDB Entry DOI: 10.7270/Q23B61CM
Muscarinic acetylcholine receptor M1
(Homo sapiens (Human))
BDBM50413111
(CHEMBL540401)
Show SMILES Cc1nc(no1)-c1ccc(NC(=O)N[C@@H](Cc2ccc(O)cc2)C(=O)N[C@H]2CCC[N+](C)(Cc3ccc(O)cc3)C2)cc1 |r|
Show InChI InChI=1S/C32H36N6O5/c1-21-33-30(37-43-21)24-9-11-25(12-10-24)35-32(42)36-29(18-22-5-13-27(39)14-6-22)31(41)34-26-4-3-17-38(2,20-26)19-23-7-15-28(40)16-8-23/h5-16,26,29H,3-4,17-20H2,1-2H3,(H4-,34,35,36,37,39,40,41,42)/p+1/t26-,29-,38?/m0/s1
n/an/an/a 126n/an/an/an/an/a
GlaxoSmithKline
Curated by ChEMBL
Assay Description
Antagonist activity at human recombinant muscarinic M1 receptor expressed in CHO cells assessed as inhibition of acetylcholine-induced intracellular ...
Bioorg Med Chem Lett 18: 5481-6 (2008)
Article DOI: 10.1016/j.bmcl.2008.09.020
BindingDB Entry DOI: 10.7270/Q23B61CM
Muscarinic acetylcholine receptor M3
(Homo sapiens (Human))
BDBM50413111
(CHEMBL540401)
Show SMILES Cc1nc(no1)-c1ccc(NC(=O)N[C@@H](Cc2ccc(O)cc2)C(=O)N[C@H]2CCC[N+](C)(Cc3ccc(O)cc3)C2)cc1 |r|
Show InChI InChI=1S/C32H36N6O5/c1-21-33-30(37-43-21)24-9-11-25(12-10-24)35-32(42)36-29(18-22-5-13-27(39)14-6-22)31(41)34-26-4-3-17-38(2,20-26)19-23-7-15-28(40)16-8-23/h5-16,26,29H,3-4,17-20H2,1-2H3,(H4-,34,35,36,37,39,40,41,42)/p+1/t26-,29-,38?/m0/s1
Reactome pathway
n/an/an/a 2n/an/an/an/an/a
GlaxoSmithKline
Curated by ChEMBL
Assay Description
Antagonist activity at human recombinant muscarinic M3 receptor expressed in CHO cells assessed as inhibition of acetylcholine-induced intracellular ...
Bioorg Med Chem Lett 18: 5481-6 (2008)
Article DOI: 10.1016/j.bmcl.2008.09.020
BindingDB Entry DOI: 10.7270/Q23B61CM