BDBM50413291 CHEMBL515240
SMILES: COc1cccc(Nc2c(cnc3ccc(cc23)S(=O)(=O)c2ccccc2)C(N)=O)c1
InChI Key: InChIKey=IURZMJIFWFMQKM-UHFFFAOYSA-N
Data: 2 IC50
Activity Spreadsheet -- Enzyme Inhibition Constant Data from BindingDB
Found 2 hits for monomerid = 50413291
Trg + Lig
Ki
nM
ΔG°
kcal/mole
IC50
nM
Kd
nM
EC50/IC50
nM
koff
s-1
kon
M-1s-1
pHTemp
°C
3',5'-cyclic phosphodiesterase
(Homo sapiens (Human))
BDBM50413291
(CHEMBL515240)
Show SMILES COc1cccc(Nc2c(cnc3ccc(cc23)S(=O)(=O)c2ccccc2)C(N)=O)c1
Show InChI InChI=1S/C23H19N3O4S/c1-30-16-7-5-6-15(12-16)26-22-19-13-18(31(28,29)17-8-3-2-4-9-17)10-11-21(19)25-14-20(22)23(24)27/h2-14H,1H3,(H2,24,27)(H,25,26)
n/an/a 1.58n/an/an/an/an/an/a
GlaxoSmithKline Medicines Research Centre
Curated by ChEMBL
Assay Description
Inhibition of human recombinant PDE4B by scintillation proximity assay
Bioorg Med Chem Lett 19: 5261-5 (2009)
Article DOI: 10.1016/j.bmcl.2009.04.012
BindingDB Entry DOI: 10.7270/Q2K075HB
3',5'-cyclic phosphodiesterase
(Homo sapiens (Human))
BDBM50413291
(CHEMBL515240)
Show SMILES COc1cccc(Nc2c(cnc3ccc(cc23)S(=O)(=O)c2ccccc2)C(N)=O)c1
Show InChI InChI=1S/C23H19N3O4S/c1-30-16-7-5-6-15(12-16)26-22-19-13-18(31(28,29)17-8-3-2-4-9-17)10-11-21(19)25-14-20(22)23(24)27/h2-14H,1H3,(H2,24,27)(H,25,26)
n/an/a 1.58n/an/an/an/an/an/a
GlaxoSmithKline Medicines Research Centre
Curated by ChEMBL
Assay Description
Inhibition of human recombinant PDE4B by scintillation proximity assay
Bioorg Med Chem Lett 19: 1380-5 (2009)
Article DOI: 10.1016/j.bmcl.2009.01.045
BindingDB Entry DOI: 10.7270/Q2FJ2J0J