BDBM50413307 CHEMBL464009
SMILES: CS(=O)(=O)c1ccc2ncc(C(N)=O)c(Nc3cccc(CN)c3)c2c1
InChI Key: InChIKey=QSCSMYDWWRLCHU-UHFFFAOYSA-N
Data: 1 IC50
Activity Spreadsheet -- Enzyme Inhibition Constant Data from BindingDB
Found 1 hit for monomerid = 50413307
Trg + Lig
Ki
nM
ΔG°
kcal/mole
IC50
nM
Kd
nM
EC50/IC50
nM
koff
s-1
kon
M-1s-1
pHTemp
°C
cAMP-specific 3',5'-cyclic phosphodiesterase 4B
(Homo sapiens (Human))
BDBM50413307
(CHEMBL464009)
Show SMILES CS(=O)(=O)c1ccc2ncc(C(N)=O)c(Nc3cccc(CN)c3)c2c1
Show InChI InChI=1S/C18H18N4O3S/c1-26(24,25)13-5-6-16-14(8-13)17(15(10-21-16)18(20)23)22-12-4-2-3-11(7-12)9-19/h2-8,10H,9,19H2,1H3,(H2,20,23)(H,21,22)
n/an/a 79.4n/an/an/an/an/an/a
GlaxoSmithKline Medicines Research Centre
Curated by ChEMBL
Assay Description
Inhibition of human recombinant PDE4B by scintillation proximity assay
Bioorg Med Chem Lett 19: 1380-5 (2009)
Article DOI: 10.1016/j.bmcl.2009.01.045
BindingDB Entry DOI: 10.7270/Q2FJ2J0J