BDBM50413339 CHEMBL502132
SMILES: CC[C@@H](C)[C@@H]1C(=O)Nc2ccc(NCCCN(C)C)cc2-c2nc3cc(ccc3n12)C(=O)NCc1cccc(c1)C(F)(F)F
InChI Key: InChIKey=FNLDJFVOPARNLY-ACSYHNTCSA-N
Data: 2 EC50
Activity Spreadsheet -- Enzyme Inhibition Constant Data from BindingDB
Found 2 hits for monomerid = 50413339
Trg + Lig
Ki
nM
ΔG°
kcal/mole
IC50
nM
Kd
nM
EC50/IC50
nM
koff
s-1
kon
M-1s-1
pHTemp
°C
Mas-related G-protein coupled receptor member X1
(Homo sapiens (Human))
BDBM50413339
(CHEMBL502132)
Show SMILES CC[C@@H](C)[C@@H]1C(=O)Nc2ccc(NCCCN(C)C)cc2-c2nc3cc(ccc3n12)C(=O)NCc1cccc(c1)C(F)(F)F |r,@:16,40|
Show InChI InChI=1S/C33H37F3N6O2/c1-5-20(2)29-32(44)40-26-12-11-24(37-14-7-15-41(3)4)18-25(26)30-39-27-17-22(10-13-28(27)42(29)30)31(43)38-19-21-8-6-9-23(16-21)33(34,35)36/h6,8-13,16-18,20,29,37H,5,7,14-15,19H2,1-4H3,(H,38,43)(H,40,44)/t20-,29-/m1/s1
n/an/an/an/a 63.1n/an/an/an/a
ACADIA Pharmaceuticals AB
Curated by ChEMBL
Assay Description
Agonist activity at human MrgX1 receptor
Bioorg Med Chem Lett 19: 1729-32 (2009)
Article DOI: 10.1016/j.bmcl.2009.01.085
BindingDB Entry DOI: 10.7270/Q29S1S8T
Mas-related G protein-coupled receptor X2 (MRGPRX2)
(Homo sapiens (Human))
BDBM50413339
(CHEMBL502132)
Show SMILES CC[C@@H](C)[C@@H]1C(=O)Nc2ccc(NCCCN(C)C)cc2-c2nc3cc(ccc3n12)C(=O)NCc1cccc(c1)C(F)(F)F |r,@:16,40|
Show InChI InChI=1S/C33H37F3N6O2/c1-5-20(2)29-32(44)40-26-12-11-24(37-14-7-15-41(3)4)18-25(26)30-39-27-17-22(10-13-28(27)42(29)30)31(43)38-19-21-8-6-9-23(16-21)33(34,35)36/h6,8-13,16-18,20,29,37H,5,7,14-15,19H2,1-4H3,(H,38,43)(H,40,44)/t20-,29-/m1/s1
n/an/an/an/a 631n/an/an/an/a
ACADIA Pharmaceuticals AB
Curated by ChEMBL
Assay Description
Agonist activity at human MrgX2 receptor
Bioorg Med Chem Lett 19: 1729-32 (2009)
Article DOI: 10.1016/j.bmcl.2009.01.085
BindingDB Entry DOI: 10.7270/Q29S1S8T