BDBM50413357 CHEMBL492934
SMILES: COc1cc(C(C)C)c(Oc2cnc(NCCS(C)(=O)=O)nc2N)cc1I
InChI Key: InChIKey=AAAAEENPAALFRN-UHFFFAOYSA-N
Data: 2 IC50
Activity Spreadsheet -- Enzyme Inhibition Constant Data from BindingDB
Found 2 hits for monomerid = 50413357
Trg + Lig
Ki
nM
ΔG°
kcal/mole
IC50
nM
Kd
nM
EC50/IC50
nM
koff
s-1
kon
M-1s-1
pHTemp
°C
P2X purinoceptor 2
(Homo sapiens (Human))
BDBM50413357
(CHEMBL492934)
Show SMILES COc1cc(C(C)C)c(Oc2cnc(NCCS(C)(=O)=O)nc2N)cc1I
Show InChI InChI=1S/C17H23IN4O4S/c1-10(2)11-7-14(25-3)12(18)8-13(11)26-15-9-21-17(22-16(15)19)20-5-6-27(4,23)24/h7-10H,5-6H2,1-4H3,(H3,19,20,21,22)
n/an/a 40n/an/an/an/an/an/a
Roche Palo Alto LLC
Curated by ChEMBL
Assay Description
Antagonist activity at human P2X2/3 receptor expressed in 1321n1c cells by FLIPR
Bioorg Med Chem Lett 19: 1632-5 (2009)
Article DOI: 10.1016/j.bmcl.2009.01.097
BindingDB Entry DOI: 10.7270/Q2DN44ZM
P2X purinoceptor 3
(RAT)
BDBM50413357
(CHEMBL492934)
Show SMILES COc1cc(C(C)C)c(Oc2cnc(NCCS(C)(=O)=O)nc2N)cc1I
Show InChI InChI=1S/C17H23IN4O4S/c1-10(2)11-7-14(25-3)12(18)8-13(11)26-15-9-21-17(22-16(15)19)20-5-6-27(4,23)24/h7-10H,5-6H2,1-4H3,(H3,19,20,21,22)
n/an/a 16n/an/an/an/an/an/a
Roche Palo Alto LLC
Curated by ChEMBL
Assay Description
Antagonist activity at rat P2X3 receptor expressed in CHO cells by FLIPR
Bioorg Med Chem Lett 19: 1632-5 (2009)
Article DOI: 10.1016/j.bmcl.2009.01.097
BindingDB Entry DOI: 10.7270/Q2DN44ZM