BDBM50413363 CHEMBL492299
SMILES: COc1cc(C(C)C)c(Oc2cnc(NC3CCN(CC3)S(C)(=O)=O)nc2N)cc1I
InChI Key: InChIKey=RQMPLNBPKOBZCO-UHFFFAOYSA-N
Data: 2 IC50
Activity Spreadsheet -- Enzyme Inhibition Constant Data from BindingDB
Found 2 hits for monomerid = 50413363
Trg + Lig
Ki
nM
ΔG°
kcal/mole
IC50
nM
Kd
nM
EC50/IC50
nM
koff
s-1
kon
M-1s-1
pHTemp
°C
P2X purinoceptor 2
(Homo sapiens (Human))
BDBM50413363
(CHEMBL492299)
Show SMILES COc1cc(C(C)C)c(Oc2cnc(NC3CCN(CC3)S(C)(=O)=O)nc2N)cc1I
Show InChI InChI=1S/C20H28IN5O4S/c1-12(2)14-9-17(29-3)15(21)10-16(14)30-18-11-23-20(25-19(18)22)24-13-5-7-26(8-6-13)31(4,27)28/h9-13H,5-8H2,1-4H3,(H3,22,23,24,25)
n/an/a 316n/an/an/an/an/an/a
Roche Palo Alto LLC
Curated by ChEMBL
Assay Description
Antagonist activity at human P2X2/3 receptor expressed in 1321n1c cells by FLIPR
Bioorg Med Chem Lett 19: 1632-5 (2009)
Article DOI: 10.1016/j.bmcl.2009.01.097
BindingDB Entry DOI: 10.7270/Q2DN44ZM
P2X purinoceptor 3
(RAT)
BDBM50413363
(CHEMBL492299)
Show SMILES COc1cc(C(C)C)c(Oc2cnc(NC3CCN(CC3)S(C)(=O)=O)nc2N)cc1I
Show InChI InChI=1S/C20H28IN5O4S/c1-12(2)14-9-17(29-3)15(21)10-16(14)30-18-11-23-20(25-19(18)22)24-13-5-7-26(8-6-13)31(4,27)28/h9-13H,5-8H2,1-4H3,(H3,22,23,24,25)
n/an/a 100n/an/an/an/an/an/a
Roche Palo Alto LLC
Curated by ChEMBL
Assay Description
Antagonist activity at rat P2X3 receptor expressed in CHO cells by FLIPR
Bioorg Med Chem Lett 19: 1632-5 (2009)
Article DOI: 10.1016/j.bmcl.2009.01.097
BindingDB Entry DOI: 10.7270/Q2DN44ZM