BDBM50413378 CHEMBL523043
SMILES: COc1cc(Oc2cnc(N)nc2N)c(cc1Br)C(C)C
InChI Key: InChIKey=UXZIOQCGIFBABV-UHFFFAOYSA-N
Data: 2 IC50
Activity Spreadsheet -- Enzyme Inhibition Constant Data from BindingDB
Found 2 hits for monomerid = 50413378
Trg + Lig
Ki
nM
ΔG°
kcal/mole
IC50
nM
Kd
nM
EC50/IC50
nM
koff
s-1
kon
M-1s-1
pHTemp
°C
P2X purinoceptor 2
(Homo sapiens (Human))
BDBM50413378
(CHEMBL523043)
Show SMILES COc1cc(Oc2cnc(N)nc2N)c(cc1Br)C(C)C
Show InChI InChI=1S/C14H17BrN4O2/c1-7(2)8-4-9(15)11(20-3)5-10(8)21-12-6-18-14(17)19-13(12)16/h4-7H,1-3H3,(H4,16,17,18,19)
n/an/a 316n/an/an/an/an/an/a
Roche Palo Alto LLC
Curated by ChEMBL
Assay Description
Inhibition of P2X2 receptor
Bioorg Med Chem Lett 19: 1628-31 (2009)
Article DOI: 10.1016/j.bmcl.2009.02.003
BindingDB Entry DOI: 10.7270/Q29023NX
P2X purinoceptor 3
(RAT)
BDBM50413378
(CHEMBL523043)
Show SMILES COc1cc(Oc2cnc(N)nc2N)c(cc1Br)C(C)C
Show InChI InChI=1S/C14H17BrN4O2/c1-7(2)8-4-9(15)11(20-3)5-10(8)21-12-6-18-14(17)19-13(12)16/h4-7H,1-3H3,(H4,16,17,18,19)
n/an/a 79n/an/an/an/an/an/a
Roche Palo Alto LLC
Curated by ChEMBL
Assay Description
Antagonist activity at rat recombinant P2X3 receptor expressed in CHO cells by FLIPR assay
Bioorg Med Chem Lett 19: 1628-31 (2009)
Article DOI: 10.1016/j.bmcl.2009.02.003
BindingDB Entry DOI: 10.7270/Q29023NX