BDBM50413403 CHEMBL521820
SMILES: COc1cc(C(C)C)c(Oc2cnc(N)nc2N)cc1C(N)=O
InChI Key: InChIKey=QRFLXLOCJNJKEJ-UHFFFAOYSA-N
Data: 2 IC50
Activity Spreadsheet -- Enzyme Inhibition Constant Data from BindingDB
Found 2 hits for monomerid = 50413403
Trg + Lig
Ki
nM
ΔG°
kcal/mole
IC50
nM
Kd
nM
EC50/IC50
nM
koff
s-1
kon
M-1s-1
pHTemp
°C
P2X purinoceptor 2
(Homo sapiens (Human))
BDBM50413403
(CHEMBL521820)
Show SMILES COc1cc(C(C)C)c(Oc2cnc(N)nc2N)cc1C(N)=O
Show InChI InChI=1S/C15H19N5O3/c1-7(2)8-4-10(22-3)9(14(17)21)5-11(8)23-12-6-19-15(18)20-13(12)16/h4-7H,1-3H3,(H2,17,21)(H4,16,18,19,20)
n/an/a 1.59E+3n/an/an/an/an/an/a
Roche Palo Alto LLC
Curated by ChEMBL
Assay Description
Inhibition of P2X2 receptor
Bioorg Med Chem Lett 19: 1628-31 (2009)
Article DOI: 10.1016/j.bmcl.2009.02.003
BindingDB Entry DOI: 10.7270/Q29023NX
P2X purinoceptor 3
(RAT)
BDBM50413403
(CHEMBL521820)
Show SMILES COc1cc(C(C)C)c(Oc2cnc(N)nc2N)cc1C(N)=O
Show InChI InChI=1S/C15H19N5O3/c1-7(2)8-4-10(22-3)9(14(17)21)5-11(8)23-12-6-19-15(18)20-13(12)16/h4-7H,1-3H3,(H2,17,21)(H4,16,18,19,20)
n/an/a 100n/an/an/an/an/an/a
Roche Palo Alto LLC
Curated by ChEMBL
Assay Description
Antagonist activity at rat recombinant P2X3 receptor expressed in CHO cells by FLIPR assay
Bioorg Med Chem Lett 19: 1628-31 (2009)
Article DOI: 10.1016/j.bmcl.2009.02.003
BindingDB Entry DOI: 10.7270/Q29023NX