BDBM50413410 CHEMBL494996
SMILES: CCN1CCN(Cc2cccc(c2)-c2cccc(CNC(=O)c3ccc4OCOc4c3)c2)CC1
InChI Key: InChIKey=TYUJFICSPZLWGO-UHFFFAOYSA-N
Data: 1 IC50
Activity Spreadsheet -- Enzyme Inhibition Constant Data from BindingDB
Found 1 hit for monomerid = 50413410
Trg + Lig
Ki
nM
ΔG°
kcal/mole
IC50
nM
Kd
nM
EC50/IC50
nM
koff
s-1
kon
M-1s-1
pHTemp
°C
Muscarinic acetylcholine receptor M3
(Homo sapiens (Human))
BDBM50413410
(CHEMBL494996)
Show SMILES CCN1CCN(Cc2cccc(c2)-c2cccc(CNC(=O)c3ccc4OCOc4c3)c2)CC1
Show InChI InChI=1S/C28H31N3O3/c1-2-30-11-13-31(14-12-30)19-22-6-4-8-24(16-22)23-7-3-5-21(15-23)18-29-28(32)25-9-10-26-27(17-25)34-20-33-26/h3-10,15-17H,2,11-14,18-20H2,1H3,(H,29,32)
Reactome pathway
n/an/a 1.58E+3n/an/an/an/an/an/a
GlaxoSmithKline
Curated by ChEMBL
Assay Description
Antagonist activity at human recombinant muscarinic M3 receptor expressed in CHO cells assessed as inhibition of acetylcholine-induced calcium mobili...
Bioorg Med Chem Lett 19: 1686-90 (2009)
Article DOI: 10.1016/j.bmcl.2009.01.098
BindingDB Entry DOI: 10.7270/Q2639QZ5