BDBM50413411 CHEMBL494997
SMILES: O=C(NCc1cccc(c1)-c1cccc(CN2CCCCC2)c1)c1ccc2OCOc2c1
InChI Key: InChIKey=JVKWHJYNBOKMGU-UHFFFAOYSA-N
Data: 1 IC50
Activity Spreadsheet -- Enzyme Inhibition Constant Data from BindingDB
Found 1 hit for monomerid = 50413411
Trg + Lig
Ki
nM
ΔG°
kcal/mole
IC50
nM
Kd
nM
EC50/IC50
nM
koff
s-1
kon
M-1s-1
pHTemp
°C
Muscarinic acetylcholine receptor M3
(Homo sapiens (Human))
BDBM50413411
(CHEMBL494997)
Show SMILES O=C(NCc1cccc(c1)-c1cccc(CN2CCCCC2)c1)c1ccc2OCOc2c1
Show InChI InChI=1S/C27H28N2O3/c30-27(24-10-11-25-26(16-24)32-19-31-25)28-17-20-6-4-8-22(14-20)23-9-5-7-21(15-23)18-29-12-2-1-3-13-29/h4-11,14-16H,1-3,12-13,17-19H2,(H,28,30)
Reactome pathway
n/an/a 6.31E+3n/an/an/an/an/an/a
GlaxoSmithKline
Curated by ChEMBL
Assay Description
Antagonist activity at human recombinant muscarinic M3 receptor expressed in CHO cells assessed as inhibition of acetylcholine-induced calcium mobili...
Bioorg Med Chem Lett 19: 1686-90 (2009)
Article DOI: 10.1016/j.bmcl.2009.01.098
BindingDB Entry DOI: 10.7270/Q2639QZ5