null
SMILES: Fc1ccc(cc1CN1CCNCC1)-c1cccc(CNC(=O)c2ccc3OCOc3c2)c1
InChI Key: InChIKey=AYOMMUGPXRFTPJ-UHFFFAOYSA-N
Activity Spreadsheet -- Enzyme Inhibition Constant Data from BindingDB
Found 1 hit for monomerid = 50413424
Trg + Lig
Ki
nM
ΔG°
kcal/mole
IC50
nM
Kd
nM
EC50/IC50
nM
koff
s-1
kon
M-1s-1
pHTemp
°C
Muscarinic acetylcholine receptor M3
(Homo sapiens (Human))
BDBM50413424
(CHEMBL492359)
Show SMILES Fc1ccc(cc1CN1CCNCC1)-c1cccc(CNC(=O)c2ccc3OCOc3c2)c1
Show InChI InChI=1S/C26H26FN3O3/c27-23-6-4-20(13-22(23)16-30-10-8-28-9-11-30)19-3-1-2-18(12-19)15-29-26(31)21-5-7-24-25(14-21)33-17-32-24/h1-7,12-14,28H,8-11,15-17H2,(H,29,31)
Reactome pathway
n/an/a 200n/an/an/an/an/an/a
GlaxoSmithKline
Curated by ChEMBL
Assay Description
Antagonist activity at human recombinant muscarinic M3 receptor expressed in CHO cells assessed as inhibition of acetylcholine-induced calcium mobili...
Bioorg Med Chem Lett 19: 1686-90 (2009)
Article DOI: 10.1016/j.bmcl.2009.01.098
BindingDB Entry DOI: 10.7270/Q2639QZ5