BDBM50413438 CHEMBL492997
SMILES: Clc1cccc(c1)C(=O)NCc1cccc(c1)-c1cccc(CN2CCNCC2)c1
InChI Key: InChIKey=OQYCMIKSVDGGPQ-UHFFFAOYSA-N
Data: 1 IC50
Activity Spreadsheet -- Enzyme Inhibition Constant Data from BindingDB
Found 1 hit for monomerid = 50413438
Trg + Lig
Ki
nM
ΔG°
kcal/mole
IC50
nM
Kd
nM
EC50/IC50
nM
koff
s-1
kon
M-1s-1
pHTemp
°C
Muscarinic acetylcholine receptor M3
(Homo sapiens (Human))
BDBM50413438
(CHEMBL492997)
Show SMILES Clc1cccc(c1)C(=O)NCc1cccc(c1)-c1cccc(CN2CCNCC2)c1
Show InChI InChI=1S/C25H26ClN3O/c26-24-9-3-8-23(16-24)25(30)28-17-19-4-1-6-21(14-19)22-7-2-5-20(15-22)18-29-12-10-27-11-13-29/h1-9,14-16,27H,10-13,17-18H2,(H,28,30)
Reactome pathway
n/an/a 100n/an/an/an/an/an/a
GlaxoSmithKline
Curated by ChEMBL
Assay Description
Antagonist activity at human recombinant muscarinic M3 receptor expressed in CHO cells assessed as inhibition of acetylcholine-induced calcium mobili...
Bioorg Med Chem Lett 19: 1686-90 (2009)
Article DOI: 10.1016/j.bmcl.2009.01.098
BindingDB Entry DOI: 10.7270/Q2639QZ5