BDBM50413439 CHEMBL492998
SMILES: Clc1ccc(cc1)C(=O)NCc1cccc(c1)-c1cccc(CN2CCNCC2)c1
InChI Key: InChIKey=ZLHVGKHJBXYUBJ-UHFFFAOYSA-N
Data: 1 IC50
Activity Spreadsheet -- Enzyme Inhibition Constant Data from BindingDB
Found 1 hit for monomerid = 50413439
Trg + Lig
Ki
nM
ΔG°
kcal/mole
IC50
nM
Kd
nM
EC50/IC50
nM
koff
s-1
kon
M-1s-1
pHTemp
°C
Muscarinic acetylcholine receptor M3
(Homo sapiens (Human))
BDBM50413439
(CHEMBL492998)
Show SMILES Clc1ccc(cc1)C(=O)NCc1cccc(c1)-c1cccc(CN2CCNCC2)c1
Show InChI InChI=1S/C25H26ClN3O/c26-24-9-7-21(8-10-24)25(30)28-17-19-3-1-5-22(15-19)23-6-2-4-20(16-23)18-29-13-11-27-12-14-29/h1-10,15-16,27H,11-14,17-18H2,(H,28,30)
Reactome pathway
n/an/a 316n/an/an/an/an/an/a
GlaxoSmithKline
Curated by ChEMBL
Assay Description
Antagonist activity at human recombinant muscarinic M3 receptor expressed in CHO cells assessed as inhibition of acetylcholine-induced calcium mobili...
Bioorg Med Chem Lett 19: 1686-90 (2009)
Article DOI: 10.1016/j.bmcl.2009.01.098
BindingDB Entry DOI: 10.7270/Q2639QZ5