null
SMILES: CN(C)c1cccc(c1)C(=O)NCc1cccc(c1)-c1cccc(CN2CCNCC2)c1
InChI Key: InChIKey=IFCARSQCGCULTA-UHFFFAOYSA-N
Activity Spreadsheet -- Enzyme Inhibition Constant Data from BindingDB
Found 1 hit for monomerid = 50413446
Trg + Lig
Ki
nM
ΔG°
kcal/mole
IC50
nM
Kd
nM
EC50/IC50
nM
koff
s-1
kon
M-1s-1
pHTemp
°C
Muscarinic acetylcholine receptor M3
(Homo sapiens (Human))
BDBM50413446
(CHEMBL494950)
Show SMILES CN(C)c1cccc(c1)C(=O)NCc1cccc(c1)-c1cccc(CN2CCNCC2)c1
Show InChI InChI=1S/C27H32N4O/c1-30(2)26-11-5-10-25(18-26)27(32)29-19-21-6-3-8-23(16-21)24-9-4-7-22(17-24)20-31-14-12-28-13-15-31/h3-11,16-18,28H,12-15,19-20H2,1-2H3,(H,29,32)
Reactome pathway
n/an/a 200n/an/an/an/an/an/a
GlaxoSmithKline
Curated by ChEMBL
Assay Description
Antagonist activity at human recombinant muscarinic M3 receptor expressed in CHO cells assessed as inhibition of acetylcholine-induced calcium mobili...
Bioorg Med Chem Lett 19: 1686-90 (2009)
Article DOI: 10.1016/j.bmcl.2009.01.098
BindingDB Entry DOI: 10.7270/Q2639QZ5