null
SMILES: CC(=O)Nc1cccc(c1)C(=O)NCc1cccc(c1)-c1cccc(CN2CCNCC2)c1
InChI Key: InChIKey=DGRHYHQFIWGGSE-UHFFFAOYSA-N
Activity Spreadsheet -- Enzyme Inhibition Constant Data from BindingDB
Found 1 hit for monomerid = 50413448
Trg + Lig
Ki
nM
ΔG°
kcal/mole
IC50
nM
Kd
nM
EC50/IC50
nM
koff
s-1
kon
M-1s-1
pHTemp
°C
Muscarinic acetylcholine receptor M3
(Homo sapiens (Human))
BDBM50413448
(CHEMBL494752)
Show SMILES CC(=O)Nc1cccc(c1)C(=O)NCc1cccc(c1)-c1cccc(CN2CCNCC2)c1
Show InChI InChI=1S/C27H30N4O2/c1-20(32)30-26-10-4-9-25(17-26)27(33)29-18-21-5-2-7-23(15-21)24-8-3-6-22(16-24)19-31-13-11-28-12-14-31/h2-10,15-17,28H,11-14,18-19H2,1H3,(H,29,33)(H,30,32)
Reactome pathway
n/an/a 200n/an/an/an/an/an/a
GlaxoSmithKline
Curated by ChEMBL
Assay Description
Antagonist activity at human recombinant muscarinic M3 receptor expressed in CHO cells assessed as inhibition of acetylcholine-induced calcium mobili...
Bioorg Med Chem Lett 19: 1686-90 (2009)
Article DOI: 10.1016/j.bmcl.2009.01.098
BindingDB Entry DOI: 10.7270/Q2639QZ5