null
SMILES: CC(=O)c1cccc(c1)C(=O)NCc1cccc(c1)-c1cccc(CN2CCNCC2)c1
InChI Key: InChIKey=PQNPJCMCZTZRMH-UHFFFAOYSA-N
Activity Spreadsheet -- Enzyme Inhibition Constant Data from BindingDB
Found 1 hit for monomerid = 50413452
Trg + Lig
Ki
nM
ΔG°
kcal/mole
IC50
nM
Kd
nM
EC50/IC50
nM
koff
s-1
kon
M-1s-1
pHTemp
°C
Muscarinic acetylcholine receptor M3
(Homo sapiens (Human))
BDBM50413452
(CHEMBL522020)
Show SMILES CC(=O)c1cccc(c1)C(=O)NCc1cccc(c1)-c1cccc(CN2CCNCC2)c1
Show InChI InChI=1S/C27H29N3O2/c1-20(31)23-7-4-10-26(17-23)27(32)29-18-21-5-2-8-24(15-21)25-9-3-6-22(16-25)19-30-13-11-28-12-14-30/h2-10,15-17,28H,11-14,18-19H2,1H3,(H,29,32)
Reactome pathway
n/an/a 10n/an/an/an/an/an/a
GlaxoSmithKline
Curated by ChEMBL
Assay Description
Antagonist activity at human recombinant muscarinic M3 receptor expressed in CHO cells assessed as inhibition of acetylcholine-induced calcium mobili...
Bioorg Med Chem Lett 19: 1686-90 (2009)
Article DOI: 10.1016/j.bmcl.2009.01.098
BindingDB Entry DOI: 10.7270/Q2639QZ5