BDBM50413459 CHEMBL523044
SMILES: CC1CN(Cc2cccc(c2)-c2cc(CNC(=O)c3cccc(CN4CCCN(C)CC4)c3)ccc2F)CCN1
InChI Key: InChIKey=AJBGYCZPYITRRR-UHFFFAOYSA-N
Data: 1 Kd
Activity Spreadsheet -- Enzyme Inhibition Constant Data from BindingDB
Found 1 hit for monomerid = 50413459
Trg + Lig
Ki
nM
ΔG°
kcal/mole
IC50
nM
Kd
nM
EC50/IC50
nM
koff
s-1
kon
M-1s-1
pHTemp
°C
Muscarinic acetylcholine receptor M3
(Homo sapiens (Human))
BDBM50413459
(CHEMBL523044)
Show SMILES CC1CN(Cc2cccc(c2)-c2cc(CNC(=O)c3cccc(CN4CCCN(C)CC4)c3)ccc2F)CCN1
Show InChI InChI=1S/C33H42FN5O/c1-25-22-39(15-12-35-25)24-27-6-3-8-29(18-27)31-20-26(10-11-32(31)34)21-36-33(40)30-9-4-7-28(19-30)23-38-14-5-13-37(2)16-17-38/h3-4,6-11,18-20,25,35H,5,12-17,21-24H2,1-2H3,(H,36,40)
Reactome pathway
n/an/an/a 0.251n/an/an/an/an/a
GlaxoSmithKline
Curated by ChEMBL
Assay Description
Antagonist activity at human recombinant muscarinic M3 receptor expressed in CHO cells assessed as inhibition of acetylcholine-induced calcium mobili...
Bioorg Med Chem Lett 19: 1686-90 (2009)
Article DOI: 10.1016/j.bmcl.2009.01.098
BindingDB Entry DOI: 10.7270/Q2639QZ5