BDBM50413460 CHEMBL494837
SMILES: CC1CN(Cc2cccc(c2)-c2cc(CNC(=O)c3cccc(CN(C)CCCN(C)C)c3)ccc2F)CCN1
InChI Key: InChIKey=CIASUTYANWXVKR-UHFFFAOYSA-N
Data: 1 Kd
Activity Spreadsheet -- Enzyme Inhibition Constant Data from BindingDB
Found 1 hit for monomerid = 50413460
Trg + Lig
Ki
nM
ΔG°
kcal/mole
IC50
nM
Kd
nM
EC50/IC50
nM
koff
s-1
kon
M-1s-1
pHTemp
°C
Muscarinic acetylcholine receptor M3
(Homo sapiens (Human))
BDBM50413460
(CHEMBL494837)
Show SMILES CC1CN(Cc2cccc(c2)-c2cc(CNC(=O)c3cccc(CN(C)CCCN(C)C)c3)ccc2F)CCN1
Show InChI InChI=1S/C33H44FN5O/c1-25-22-39(17-14-35-25)24-28-9-5-10-29(18-28)31-20-26(12-13-32(31)34)21-36-33(40)30-11-6-8-27(19-30)23-38(4)16-7-15-37(2)3/h5-6,8-13,18-20,25,35H,7,14-17,21-24H2,1-4H3,(H,36,40)
Reactome pathway
n/an/an/a 0.200n/an/an/an/an/a
GlaxoSmithKline
Curated by ChEMBL
Assay Description
Antagonist activity at human recombinant muscarinic M3 receptor expressed in CHO cells assessed as inhibition of acetylcholine-induced calcium mobili...
Bioorg Med Chem Lett 19: 1686-90 (2009)
Article DOI: 10.1016/j.bmcl.2009.01.098
BindingDB Entry DOI: 10.7270/Q2639QZ5