BDBM50413463 CHEMBL522495
SMILES: CC1CN(Cc2cccc(c2)-c2cc(CNC(=O)c3cccc(CN4CCCCC4)c3)ccc2F)CCN1
InChI Key: InChIKey=TVVVKJSBUJENQR-UHFFFAOYSA-N
Data: 1 Kd
Activity Spreadsheet -- Enzyme Inhibition Constant Data from BindingDB
Found 1 hit for monomerid = 50413463
Trg + Lig
Ki
nM
ΔG°
kcal/mole
IC50
nM
Kd
nM
EC50/IC50
nM
koff
s-1
kon
M-1s-1
pHTemp
°C
Muscarinic acetylcholine receptor M3
(Homo sapiens (Human))
BDBM50413463
(CHEMBL522495)
Show SMILES CC1CN(Cc2cccc(c2)-c2cc(CNC(=O)c3cccc(CN4CCCCC4)c3)ccc2F)CCN1
Show InChI InChI=1S/C32H39FN4O/c1-24-21-37(16-13-34-24)23-26-7-5-9-28(17-26)30-19-25(11-12-31(30)33)20-35-32(38)29-10-6-8-27(18-29)22-36-14-3-2-4-15-36/h5-12,17-19,24,34H,2-4,13-16,20-23H2,1H3,(H,35,38)
Reactome pathway
n/an/an/a 0.631n/an/an/an/an/a
GlaxoSmithKline
Curated by ChEMBL
Assay Description
Antagonist activity at human recombinant muscarinic M3 receptor expressed in CHO cells assessed as inhibition of acetylcholine-induced calcium mobili...
Bioorg Med Chem Lett 19: 1686-90 (2009)
Article DOI: 10.1016/j.bmcl.2009.01.098
BindingDB Entry DOI: 10.7270/Q2639QZ5