BDBM50413507 CHEMBL475620::UR-PI182
SMILES: NC(NC(=O)CCCNC(=O)c1cc2ccccc2[nH]1)=NCCCc1cnc[nH]1
InChI Key: InChIKey=MMZFKVNBNHUWDT-UHFFFAOYSA-N
Data: 2 EC50
Activity Spreadsheet -- Enzyme Inhibition Constant Data from BindingDB
Found 2 hits for monomerid = 50413507
Trg + Lig
Ki
nM
ΔG°
kcal/mole
IC50
nM
Kd
nM
EC50/IC50
nM
koff
s-1
kon
M-1s-1
pHTemp
°C
Histamine H2 Receptor
(Homo sapiens (Human))
BDBM50413507
(CHEMBL475620 | UR-PI182)
Show SMILES NC(NC(=O)CCCNC(=O)c1cc2ccccc2[nH]1)=NCCCc1cnc[nH]1 |w:20.22|
Show InChI InChI=1S/C20H25N7O2/c21-20(24-10-3-6-15-12-22-13-25-15)27-18(28)8-4-9-23-19(29)17-11-14-5-1-2-7-16(14)26-17/h1-2,5,7,11-13,26H,3-4,6,8-10H2,(H,22,25)(H,23,29)(H3,21,24,27,28)
Reactome pathway
n/an/an/an/a 30n/an/an/an/a
University of Regensburg
Curated by ChEMBL
Assay Description
Agonist activity at human H2 receptor expressed in insect Sf9 cells co-expressing GsalphaS fusion protein assessed as gamma[32P]GTP binding by liquid...
J Med Chem 52: 2623-7 (2009)
Article DOI: 10.1021/jm9000693
BindingDB Entry DOI: 10.7270/Q2P270BN
Histamine H2 receptor
(Cavia porcellus (domestic guinea pig))
BDBM50413507
(CHEMBL475620 | UR-PI182)
Show SMILES NC(NC(=O)CCCNC(=O)c1cc2ccccc2[nH]1)=NCCCc1cnc[nH]1 |w:20.22|
Show InChI InChI=1S/C20H25N7O2/c21-20(24-10-3-6-15-12-22-13-25-15)27-18(28)8-4-9-23-19(29)17-11-14-5-1-2-7-16(14)26-17/h1-2,5,7,11-13,26H,3-4,6,8-10H2,(H,22,25)(H,23,29)(H3,21,24,27,28)
n/an/an/an/a 490n/an/an/an/a
University of Regensburg
Curated by ChEMBL
Assay Description
Agonist activity at histamine H2 receptor in guinea pig atrium assessed as increase in heart rate
J Med Chem 52: 2623-7 (2009)
Article DOI: 10.1021/jm9000693
BindingDB Entry DOI: 10.7270/Q2P270BN