BDBM50413552 CHEMBL472289
SMILES: CN1C(=O)COc2cc(CCN3CCN(CC3)c3cccc4nc(C)ccc34)ccc12
InChI Key: InChIKey=FVOMJILQPSVRHS-UHFFFAOYSA-N
Data: 4 KI  1 EC50
Activity Spreadsheet -- Enzyme Inhibition Constant Data from BindingDB
Found 5 hits for monomerid = 50413552
Trg + Lig
Ki
nM
ΔG°
kcal/mole
IC50
nM
Kd
nM
EC50/IC50
nM
koff
s-1
kon
M-1s-1
pHTemp
°C
5-hydroxytryptamine receptor 1D
(Homo sapiens (Human))
BDBM50413552
(CHEMBL472289)
Show SMILES CN1C(=O)COc2cc(CCN3CCN(CC3)c3cccc4nc(C)ccc34)ccc12
Show InChI InChI=1S/C25H28N4O2/c1-18-6-8-20-21(26-18)4-3-5-22(20)29-14-12-28(13-15-29)11-10-19-7-9-23-24(16-19)31-17-25(30)27(23)2/h3-9,16H,10-15,17H2,1-2H3
Reactome pathway
5.01n/an/an/an/an/an/an/an/a
GlaxoSmithKline
Curated by ChEMBL
Assay Description
Antagonist activity at human 5HT1D assessed as GTPgammaS binding by scintillation proximity assay in presence of 5-HT
Bioorg Med Chem Lett 19: 2338-42 (2009)
Article DOI: 10.1016/j.bmcl.2009.02.056
BindingDB Entry DOI: 10.7270/Q2J967MX
Sodium-dependent serotonin transporter
(Homo sapiens (Human))
BDBM50413552
(CHEMBL472289)
Show SMILES CN1C(=O)COc2cc(CCN3CCN(CC3)c3cccc4nc(C)ccc34)ccc12
Show InChI InChI=1S/C25H28N4O2/c1-18-6-8-20-21(26-18)4-3-5-22(20)29-14-12-28(13-15-29)11-10-19-7-9-23-24(16-19)31-17-25(30)27(23)2/h3-9,16H,10-15,17H2,1-2H3
158n/an/an/an/an/an/an/an/a
GlaxoSmithKline
Curated by ChEMBL
Assay Description
Displacement of [3H]citalopram human SerT receptor expressed in LLCPK cells
Bioorg Med Chem Lett 19: 2338-42 (2009)
Article DOI: 10.1016/j.bmcl.2009.02.056
BindingDB Entry DOI: 10.7270/Q2J967MX
5-hydroxytryptamine receptor 1A
(Homo sapiens (Human))
BDBM50413552
(CHEMBL472289)
Show SMILES CN1C(=O)COc2cc(CCN3CCN(CC3)c3cccc4nc(C)ccc34)ccc12
Show InChI InChI=1S/C25H28N4O2/c1-18-6-8-20-21(26-18)4-3-5-22(20)29-14-12-28(13-15-29)11-10-19-7-9-23-24(16-19)31-17-25(30)27(23)2/h3-9,16H,10-15,17H2,1-2H3
>3.16E+3n/an/an/an/an/an/an/an/a
GlaxoSmithKline
Curated by ChEMBL
Assay Description
Antagonist activity at human 5HT1A assessed as GTPgammaS binding by scintillation proximity assay in presence of 5-HT
Bioorg Med Chem Lett 19: 2338-42 (2009)
Article DOI: 10.1016/j.bmcl.2009.02.056
BindingDB Entry DOI: 10.7270/Q2J967MX
Potassium voltage-gated channel subfamily H member 2
(Homo sapiens (Human))
BDBM50413552
(CHEMBL472289)
Show SMILES CN1C(=O)COc2cc(CCN3CCN(CC3)c3cccc4nc(C)ccc34)ccc12
Show InChI InChI=1S/C25H28N4O2/c1-18-6-8-20-21(26-18)4-3-5-22(20)29-14-12-28(13-15-29)11-10-19-7-9-23-24(16-19)31-17-25(30)27(23)2/h3-9,16H,10-15,17H2,1-2H3
Reactome pathway
3.16E+3n/an/an/an/an/an/an/an/a
GlaxoSmithKline
Curated by ChEMBL
Assay Description
Displacement of [3H]dofetilide human ERG expressed in CHO cells
Bioorg Med Chem Lett 19: 2338-42 (2009)
Article DOI: 10.1016/j.bmcl.2009.02.056
BindingDB Entry DOI: 10.7270/Q2J967MX
5-hydroxytryptamine receptor 1B
(Homo sapiens (Human))
BDBM50413552
(CHEMBL472289)
Show SMILES CN1C(=O)COc2cc(CCN3CCN(CC3)c3cccc4nc(C)ccc34)ccc12
Show InChI InChI=1S/C25H28N4O2/c1-18-6-8-20-21(26-18)4-3-5-22(20)29-14-12-28(13-15-29)11-10-19-7-9-23-24(16-19)31-17-25(30)27(23)2/h3-9,16H,10-15,17H2,1-2H3
Reactome pathway
n/an/an/an/a 6.31n/an/an/an/a
GlaxoSmithKline
Curated by ChEMBL
Assay Description
Agonist activity at human 5HT1B assessed as GTPgammaS binding by scintillation proximity assay
Bioorg Med Chem Lett 19: 2338-42 (2009)
Article DOI: 10.1016/j.bmcl.2009.02.056
BindingDB Entry DOI: 10.7270/Q2J967MX