BDBM50413644 CHEMBL446329
SMILES: COC(=O)Nc1ccc2occ(CCNC(C)=O)c2c1
InChI Key: InChIKey=ZINMQJVLELNGRZ-UHFFFAOYSA-N
Data: 1 IC50
Activity Spreadsheet -- Enzyme Inhibition Constant Data from BindingDB
Found 1 hit for monomerid = 50413644
Trg + Lig
Ki
nM
ΔG°
kcal/mole
IC50
nM
Kd
nM
EC50/IC50
nM
koff
s-1
kon
M-1s-1
pHTemp
°C
Ribosyldihydronicotinamide dehydrogenase [quinone]
(Homo sapiens (Human))
BDBM50413644
(CHEMBL446329)
Show SMILES COC(=O)Nc1ccc2occ(CCNC(C)=O)c2c1
Show InChI InChI=1S/C14H16N2O4/c1-9(17)15-6-5-10-8-20-13-4-3-11(7-12(10)13)16-14(18)19-2/h3-4,7-8H,5-6H2,1-2H3,(H,15,17)(H,16,18)
n/an/a 15.8n/an/an/an/an/an/a
Lanzhou University
Curated by ChEMBL
Assay Description
Displacement of [125I]iodomelatonin from MT3/QR2 melatonin binding site expressed in CHO cells
Eur J Med Chem 43: 2861-9 (2008)
Article DOI: 10.1016/j.ejmech.2008.02.012
BindingDB Entry DOI: 10.7270/Q21C1Z31