BDBM50413663 CHEMBL466549
SMILES: [O-]C(=O)c1cccc(n1)-c1ccccc1-c1cc(Cl)ccc1OCc1c(F)cc(F)cc1F
InChI Key: InChIKey=BVLCSIUFDMFIQQ-UHFFFAOYSA-M
Data: 1 IC50
Activity Spreadsheet -- Enzyme Inhibition Constant Data from BindingDB
Found 1 hit for monomerid = 50413663
Trg + Lig
Ki
nM
ΔG°
kcal/mole
IC50
nM
Kd
nM
EC50/IC50
nM
koff
s-1
kon
M-1s-1
pHTemp
°C
Prostaglandin E2 receptor EP1 subtype (EP1)
(Homo sapiens (Human))
BDBM50413663
(CHEMBL466549)
Show SMILES [O-]C(=O)c1cccc(n1)-c1ccccc1-c1cc(Cl)ccc1OCc1c(F)cc(F)cc1F
Show InChI InChI=1S/C25H15ClF3NO3/c26-14-8-9-24(33-13-19-20(28)11-15(27)12-21(19)29)18(10-14)16-4-1-2-5-17(16)22-6-3-7-23(30-22)25(31)32/h1-12H,13H2,(H,31,32)/p-1
n/an/a 12.6n/an/an/an/an/an/a
GlaxoSmithKline
Curated by ChEMBL
Assay Description
Binding affinity to EP1 receptor
Bioorg Med Chem Lett 19: 497-501 (2008)
Article DOI: 10.1016/j.bmcl.2008.11.032
BindingDB Entry DOI: 10.7270/Q2N879N5