BDBM50413665 CHEMBL467578
SMILES: [O-]C(=O)c1cccc(n1)-c1ccccc1-c1cc(Cl)ccc1OCc1ccc(Br)cc1F
InChI Key: InChIKey=XXRNACAEFNCEJB-UHFFFAOYSA-M
Data: 1 IC50
Activity Spreadsheet -- Enzyme Inhibition Constant Data from BindingDB
Found 1 hit for monomerid = 50413665
Trg + Lig
Ki
nM
ΔG°
kcal/mole
IC50
nM
Kd
nM
EC50/IC50
nM
koff
s-1
kon
M-1s-1
pHTemp
°C
Prostaglandin E2 receptor EP1 subtype (EP1)
(Homo sapiens (Human))
BDBM50413665
(CHEMBL467578)
Show SMILES [O-]C(=O)c1cccc(n1)-c1ccccc1-c1cc(Cl)ccc1OCc1ccc(Br)cc1F
Show InChI InChI=1S/C25H16BrClFNO3/c26-16-9-8-15(21(28)12-16)14-32-24-11-10-17(27)13-20(24)18-4-1-2-5-19(18)22-6-3-7-23(29-22)25(30)31/h1-13H,14H2,(H,30,31)/p-1
n/an/a 50.1n/an/an/an/an/an/a
GlaxoSmithKline
Curated by ChEMBL
Assay Description
Binding affinity to EP1 receptor
Bioorg Med Chem Lett 19: 497-501 (2008)
Article DOI: 10.1016/j.bmcl.2008.11.032
BindingDB Entry DOI: 10.7270/Q2N879N5