BDBM50413755 CHEMBL469131
SMILES: CC(C)NC(=O)N1CCN(CC1)C(c1ccc(Cl)cc1)c1ccccc1C
InChI Key: InChIKey=SMAJIXOOJCUMFD-UHFFFAOYSA-N
Data: 1 IC50
Activity Spreadsheet -- Enzyme Inhibition Constant Data from BindingDB
Found 1 hit for monomerid = 50413755
Trg + Lig
Ki
nM
ΔG°
kcal/mole
IC50
nM
Kd
nM
EC50/IC50
nM
koff
s-1
kon
M-1s-1
pHTemp
°C
Cannabinoid receptor 1
(Homo sapiens (Human))
BDBM50413755
(CHEMBL469131)
Show SMILES CC(C)NC(=O)N1CCN(CC1)C(c1ccc(Cl)cc1)c1ccccc1C
Show InChI InChI=1S/C22H28ClN3O/c1-16(2)24-22(27)26-14-12-25(13-15-26)21(18-8-10-19(23)11-9-18)20-7-5-4-6-17(20)3/h4-11,16,21H,12-15H2,1-3H3,(H,24,27)
NCI pathway
Reactome pathway
n/an/a 2.19E+3n/an/an/an/an/an/a
Korea Research Institute of Chemical Technology
Curated by ChEMBL
Assay Description
Antagonist activity against human recombinant cannabinoid-1 receptor
Bioorg Med Chem Lett 19: 2990-6 (2009)
Article DOI: 10.1016/j.bmcl.2009.04.037
BindingDB Entry DOI: 10.7270/Q2CN7543