BDBM50413757 CHEMBL511907
SMILES: CC(C)(C)c1c(nn(c1-c1ccc(Cl)cc1)-c1ccc(Cl)cc1Cl)C(=O)NN1CCCCC1
InChI Key: InChIKey=AGUKQCZHXHAYCS-UHFFFAOYSA-N
Data: 1 IC50
Activity Spreadsheet -- Enzyme Inhibition Constant Data from BindingDB
Found 1 hit for monomerid = 50413757
Trg + Lig
Ki
nM
ΔG°
kcal/mole
IC50
nM
Kd
nM
EC50/IC50
nM
koff
s-1
kon
M-1s-1
pHTemp
°C
Cannabinoid receptor 1
(Homo sapiens (Human))
BDBM50413757
(CHEMBL511907)
Show SMILES CC(C)(C)c1c(nn(c1-c1ccc(Cl)cc1)-c1ccc(Cl)cc1Cl)C(=O)NN1CCCCC1
Show InChI InChI=1S/C25H27Cl3N4O/c1-25(2,3)21-22(24(33)30-31-13-5-4-6-14-31)29-32(20-12-11-18(27)15-19(20)28)23(21)16-7-9-17(26)10-8-16/h7-12,15H,4-6,13-14H2,1-3H3,(H,30,33)
NCI pathway
Reactome pathway
n/an/a 6.17n/an/an/an/an/an/a
Korea Research Institute of Chemical Technology
Curated by ChEMBL
Assay Description
Antagonist activity against human recombinant cannabinoid-1 receptor
Bioorg Med Chem Lett 19: 2990-6 (2009)
Article DOI: 10.1016/j.bmcl.2009.04.037
BindingDB Entry DOI: 10.7270/Q2CN7543