BDBM50413864 CHEMBL2021481
SMILES: C[C@H](O)COc1ccccc1
InChI Key: InChIKey=IBLKWZIFZMJLFL-QMMMGPOBSA-N
Data: 1 EC50
Activity Spreadsheet -- Enzyme Inhibition Constant Data from BindingDB
Found 1 hit for monomerid = 50413864
Trg + Lig
Ki
nM
ΔG°
kcal/mole
IC50
nM
Kd
nM
EC50/IC50
nM
koff
s-1
kon
M-1s-1
pHTemp
°C
Voltage-gated sodium channel subunit alpha Nav1.4 (Nav1.4)
(Homo sapiens (Human))
BDBM50413864
(CHEMBL2021481)
Show SMILES C[C@H](O)COc1ccccc1 |r|
Show InChI InChI=1S/C9H12O2/c1-8(10)7-11-9-5-3-2-4-6-9/h2-6,8,10H,7H2,1H3/t8-/m0/s1
n/an/an/an/a 2.34E+5n/an/an/an/a
Universit£ degli Studi di Bari
Curated by ChEMBL
Assay Description
Inhibition of Nav1.4 ion channel assessed as reduction in cumulative sodium current
Eur J Med Chem 44: 1477-85 (2009)
Article DOI: 10.1016/j.ejmech.2008.10.005
BindingDB Entry DOI: 10.7270/Q2M61MGC