null
SMILES: C[C@@H](CN)CSc1c(C)cccc1C
InChI Key: InChIKey=DKPRBIUBNMXBKY-VIFPVBQESA-N
Activity Spreadsheet -- Enzyme Inhibition Constant Data from BindingDB
Found 1 hit for monomerid = 50413870
Trg + Lig
Ki
nM
ΔG°
kcal/mole
IC50
nM
Kd
nM
EC50/IC50
nM
koff
s-1
kon
M-1s-1
pHTemp
°C
Sodium channel protein type 4 subunit alpha
(Homo sapiens (Human))
BDBM50413870
(CHEMBL444700)
Show SMILES C[C@@H](CN)CSc1c(C)cccc1C |r|
Show InChI InChI=1S/C12H19NS/c1-9(7-13)8-14-12-10(2)5-4-6-11(12)3/h4-6,9H,7-8,13H2,1-3H3/t9-/m0/s1
n/an/an/an/a 1.91E+3n/an/an/an/a
Universit£ degli Studi di Bari
Curated by ChEMBL
Assay Description
Inhibition of Nav1.4 ion channel assessed as reduction in cumulative sodium current
Eur J Med Chem 44: 1477-85 (2009)
Article DOI: 10.1016/j.ejmech.2008.10.005
BindingDB Entry DOI: 10.7270/Q2M61MGC