BDBM50414493 CHEMBL565055
SMILES: OC(=O)c1cc([nH]n1)N(Cc1ccoc1)Cc1ccoc1
InChI Key: InChIKey=WEOFJSCZILSXTN-UHFFFAOYSA-N
Data: 1 EC50
Activity Spreadsheet -- Enzyme Inhibition Constant Data from BindingDB
Found 1 hit for monomerid = 50414493
Trg + Lig
Ki
nM
ΔG°
kcal/mole
IC50
nM
Kd
nM
EC50/IC50
nM
koff
s-1
kon
M-1s-1
pHTemp
°C
HM74 nicotinic acid GPCR
(Homo sapiens (Human))
BDBM50414493
(CHEMBL565055)
Show SMILES OC(=O)c1cc([nH]n1)N(Cc1ccoc1)Cc1ccoc1
Show InChI InChI=1S/C14H13N3O4/c18-14(19)12-5-13(16-15-12)17(6-10-1-3-20-8-10)7-11-2-4-21-9-11/h1-5,8-9H,6-7H2,(H,15,16)(H,18,19)
n/an/an/an/a 8.91E+3n/an/an/an/a
Arena Pharmaceuticals
Curated by ChEMBL
Assay Description
Agonist activity at GPR109b receptor transfected in CHOK1 cells assessed as inhibition of forskolin-induced cAMP generation by HTRF assay
Bioorg Med Chem Lett 19: 4207-9 (2009)
Article DOI: 10.1016/j.bmcl.2009.05.108
BindingDB Entry DOI: 10.7270/Q2GF0TJJ