BDBM50414495 CHEMBL562675
SMILES: OC(=O)c1cc([nH]n1)N(Cc1cccs1)Cc1cccs1
InChI Key: InChIKey=CRPAOVLVWKPDPW-UHFFFAOYSA-N
Data: 2 EC50
Activity Spreadsheet -- Enzyme Inhibition Constant Data from BindingDB
Found 2 hits for monomerid = 50414495
Trg + Lig
Ki
nM
ΔG°
kcal/mole
IC50
nM
Kd
nM
EC50/IC50
nM
koff
s-1
kon
M-1s-1
pHTemp
°C
Hydroxycarboxylic acid receptor 2
(Homo sapiens (Human))
BDBM50414495
(CHEMBL562675)
Show SMILES OC(=O)c1cc([nH]n1)N(Cc1cccs1)Cc1cccs1
Show InChI InChI=1S/C14H13N3O2S2/c18-14(19)12-7-13(16-15-12)17(8-10-3-1-5-20-10)9-11-4-2-6-21-11/h1-7H,8-9H2,(H,15,16)(H,18,19)
Reactome pathway
n/an/an/an/a<1.00E+4n/an/an/an/a
Arena Pharmaceuticals
Curated by ChEMBL
Assay Description
Agonist activity at GPR109a receptor transfected in CHOK1 cells assessed as inhibition of forskolin-induced cAMP generation by HTRF assay
Bioorg Med Chem Lett 19: 4207-9 (2009)
Article DOI: 10.1016/j.bmcl.2009.05.108
BindingDB Entry DOI: 10.7270/Q2GF0TJJ
HM74 nicotinic acid GPCR
(Homo sapiens (Human))
BDBM50414495
(CHEMBL562675)
Show SMILES OC(=O)c1cc([nH]n1)N(Cc1cccs1)Cc1cccs1
Show InChI InChI=1S/C14H13N3O2S2/c18-14(19)12-7-13(16-15-12)17(8-10-3-1-5-20-10)9-11-4-2-6-21-11/h1-7H,8-9H2,(H,15,16)(H,18,19)
n/an/an/an/a 257n/an/an/an/a
Arena Pharmaceuticals
Curated by ChEMBL
Assay Description
Agonist activity at GPR109b receptor transfected in CHOK1 cells assessed as inhibition of forskolin-induced cAMP generation by HTRF assay
Bioorg Med Chem Lett 19: 4207-9 (2009)
Article DOI: 10.1016/j.bmcl.2009.05.108
BindingDB Entry DOI: 10.7270/Q2GF0TJJ