BDBM50414506 CHEMBL553415
SMILES: CCC(C)Nc1cc(n[nH]1)C(O)=O
InChI Key: InChIKey=JSXSIPPVLDPZIO-UHFFFAOYSA-N
Data: 1 EC50
Activity Spreadsheet -- Enzyme Inhibition Constant Data from BindingDB
Found 1 hit for monomerid = 50414506
Trg + Lig
Ki
nM
ΔG°
kcal/mole
IC50
nM
Kd
nM
EC50/IC50
nM
koff
s-1
kon
M-1s-1
pHTemp
°C
HM74 nicotinic acid GPCR
(Homo sapiens (Human))
BDBM50414506
(CHEMBL553415)
Show SMILES CCC(C)Nc1cc(n[nH]1)C(O)=O
Show InChI InChI=1S/C8H13N3O2/c1-3-5(2)9-7-4-6(8(12)13)10-11-7/h4-5H,3H2,1-2H3,(H,12,13)(H2,9,10,11)
n/an/an/an/a 4.47E+3n/an/an/an/a
Arena Pharmaceuticals
Curated by ChEMBL
Assay Description
Agonist activity at GPR109b receptor transfected in CHOK1 cells assessed as inhibition of forskolin-induced cAMP generation by HTRF assay
Bioorg Med Chem Lett 19: 4207-9 (2009)
Article DOI: 10.1016/j.bmcl.2009.05.108
BindingDB Entry DOI: 10.7270/Q2GF0TJJ