BDBM50414563 CHEMBL559873
SMILES: Clc1cccc(c1)N1CCN(CCN2CCCc3sccc3C2)C1=O
InChI Key: InChIKey=KAEBDVFJWYJWBA-UHFFFAOYSA-N
Data: 4 KI  2 IC50
Activity Spreadsheet -- Enzyme Inhibition Constant Data from BindingDB
Found 6 hits for monomerid = 50414563
Trg + Lig
Ki
nM
ΔG°
kcal/mole
IC50
nM
Kd
nM
EC50/IC50
nM
koff
s-1
kon
M-1s-1
pHTemp
°C
D(3) dopamine receptor
(Homo sapiens (Human))
BDBM50414563
(CHEMBL559873)
Show SMILES Clc1cccc(c1)N1CCN(CCN2CCCc3sccc3C2)C1=O
Show InChI InChI=1S/C19H22ClN3OS/c20-16-3-1-4-17(13-16)23-11-10-22(19(23)24)9-8-21-7-2-5-18-15(14-21)6-12-25-18/h1,3-4,6,12-13H,2,5,7-11,14H2
0.631n/an/an/an/an/an/an/an/a
Cancer Therapeutics
Curated by ChEMBL
Assay Description
Antagonist activity at human D3 receptor expressed in CHO cells by [35S]GTPgammaS binding assay
Bioorg Med Chem Lett 19: 4799-801 (2009)
Article DOI: 10.1016/j.bmcl.2009.06.043
BindingDB Entry DOI: 10.7270/Q2154J9T
D(3) dopamine receptor
(Homo sapiens (Human))
BDBM50414563
(CHEMBL559873)
Show SMILES Clc1cccc(c1)N1CCN(CCN2CCCc3sccc3C2)C1=O
Show InChI InChI=1S/C19H22ClN3OS/c20-16-3-1-4-17(13-16)23-11-10-22(19(23)24)9-8-21-7-2-5-18-15(14-21)6-12-25-18/h1,3-4,6,12-13H,2,5,7-11,14H2
0.631n/an/an/an/an/an/an/an/a
Imperial College London
Curated by ChEMBL
Assay Description
Binding affinity to human DRD3 receptor by GTPgammaS binding assay
Bioorg Med Chem Lett 19: 5056-9 (2009)
Article DOI: 10.1016/j.bmcl.2009.07.055
BindingDB Entry DOI: 10.7270/Q2PR7X7C
D(2) dopamine receptor
(Homo sapiens (Human))
BDBM50414563
(CHEMBL559873)
Show SMILES Clc1cccc(c1)N1CCN(CCN2CCCc3sccc3C2)C1=O
Show InChI InChI=1S/C19H22ClN3OS/c20-16-3-1-4-17(13-16)23-11-10-22(19(23)24)9-8-21-7-2-5-18-15(14-21)6-12-25-18/h1,3-4,6,12-13H,2,5,7-11,14H2
Reactome pathway
3.16n/an/an/an/an/an/an/an/a
Imperial College London
Curated by ChEMBL
Assay Description
Binding affinity to human DRD2 receptor by GTPgammaS binding assay
Bioorg Med Chem Lett 19: 5056-9 (2009)
Article DOI: 10.1016/j.bmcl.2009.07.055
BindingDB Entry DOI: 10.7270/Q2PR7X7C
D(2) dopamine receptor
(Homo sapiens (Human))
BDBM50414563
(CHEMBL559873)
Show SMILES Clc1cccc(c1)N1CCN(CCN2CCCc3sccc3C2)C1=O
Show InChI InChI=1S/C19H22ClN3OS/c20-16-3-1-4-17(13-16)23-11-10-22(19(23)24)9-8-21-7-2-5-18-15(14-21)6-12-25-18/h1,3-4,6,12-13H,2,5,7-11,14H2
Reactome pathway
3.16n/an/an/an/an/an/an/an/a
Cancer Therapeutics
Curated by ChEMBL
Assay Description
Antagonist activity at human D2 receptor expressed in CHO cells by [35S]GTPgammaS binding assay
Bioorg Med Chem Lett 19: 4799-801 (2009)
Article DOI: 10.1016/j.bmcl.2009.06.043
BindingDB Entry DOI: 10.7270/Q2154J9T
Potassium voltage-gated channel subfamily H member 2
(Homo sapiens (Human))
BDBM50414563
(CHEMBL559873)
Show SMILES Clc1cccc(c1)N1CCN(CCN2CCCc3sccc3C2)C1=O
Show InChI InChI=1S/C19H22ClN3OS/c20-16-3-1-4-17(13-16)23-11-10-22(19(23)24)9-8-21-7-2-5-18-15(14-21)6-12-25-18/h1,3-4,6,12-13H,2,5,7-11,14H2
Reactome pathway
n/an/a 794n/an/an/an/an/an/a
Imperial College London
Curated by ChEMBL
Assay Description
Displacement of [3H]dofetilide from human ERG
Bioorg Med Chem Lett 19: 5056-9 (2009)
Article DOI: 10.1016/j.bmcl.2009.07.055
BindingDB Entry DOI: 10.7270/Q2PR7X7C
Potassium voltage-gated channel subfamily H member 2
(Homo sapiens (Human))
BDBM50414563
(CHEMBL559873)
Show SMILES Clc1cccc(c1)N1CCN(CCN2CCCc3sccc3C2)C1=O
Show InChI InChI=1S/C19H22ClN3OS/c20-16-3-1-4-17(13-16)23-11-10-22(19(23)24)9-8-21-7-2-5-18-15(14-21)6-12-25-18/h1,3-4,6,12-13H,2,5,7-11,14H2
Reactome pathway
n/an/a 794n/an/an/an/an/an/a
Cancer Therapeutics
Curated by ChEMBL
Assay Description
Displacement of [3H]dofetilide from human ERG channel by scintillation proximity assay
Bioorg Med Chem Lett 19: 4799-801 (2009)
Article DOI: 10.1016/j.bmcl.2009.06.043
BindingDB Entry DOI: 10.7270/Q2154J9T