BDBM50414581 CHEMBL560270
SMILES: CN(CCN1CCN(C1=O)c1cccc(C)c1)C[C@@]12CC[C@@H](CC1)C2(C)C
InChI Key: InChIKey=CRSXTGXQBKLMCN-OKDJAKQTSA-N
Data: 4 KI  2 IC50
Activity Spreadsheet -- Enzyme Inhibition Constant Data from BindingDB
Found 6 hits for monomerid = 50414581
Trg + Lig
Ki
nM
ΔG°
kcal/mole
IC50
nM
Kd
nM
EC50/IC50
nM
koff
s-1
kon
M-1s-1
pHTemp
°C
D(3) dopamine receptor
(Homo sapiens (Human))
BDBM50414581
(CHEMBL560270)
Show SMILES CN(CCN1CCN(C1=O)c1cccc(C)c1)C[C@@]12CC[C@@H](CC1)C2(C)C |r|
Show InChI InChI=1S/C23H35N3O/c1-18-6-5-7-20(16-18)26-15-14-25(21(26)27)13-12-24(4)17-23-10-8-19(9-11-23)22(23,2)3/h5-7,16,19H,8-15,17H2,1-4H3/t19-,23+
19.9n/an/an/an/an/an/an/an/a
Cancer Therapeutics
Curated by ChEMBL
Assay Description
Antagonist activity at human D3 receptor expressed in CHO cells by [35S]GTPgammaS binding assay
Bioorg Med Chem Lett 19: 4799-801 (2009)
Article DOI: 10.1016/j.bmcl.2009.06.043
BindingDB Entry DOI: 10.7270/Q2154J9T
D(3) dopamine receptor
(Homo sapiens (Human))
BDBM50414581
(CHEMBL560270)
Show SMILES CN(CCN1CCN(C1=O)c1cccc(C)c1)C[C@@]12CC[C@@H](CC1)C2(C)C |r|
Show InChI InChI=1S/C23H35N3O/c1-18-6-5-7-20(16-18)26-15-14-25(21(26)27)13-12-24(4)17-23-10-8-19(9-11-23)22(23,2)3/h5-7,16,19H,8-15,17H2,1-4H3/t19-,23+
19.9n/an/an/an/an/an/an/an/a
Imperial College London
Curated by ChEMBL
Assay Description
Binding affinity to human DRD3 receptor by GTPgammaS binding assay
Bioorg Med Chem Lett 19: 5056-9 (2009)
Article DOI: 10.1016/j.bmcl.2009.07.055
BindingDB Entry DOI: 10.7270/Q2PR7X7C
D(2) dopamine receptor
(Homo sapiens (Human))
BDBM50414581
(CHEMBL560270)
Show SMILES CN(CCN1CCN(C1=O)c1cccc(C)c1)C[C@@]12CC[C@@H](CC1)C2(C)C |r|
Show InChI InChI=1S/C23H35N3O/c1-18-6-5-7-20(16-18)26-15-14-25(21(26)27)13-12-24(4)17-23-10-8-19(9-11-23)22(23,2)3/h5-7,16,19H,8-15,17H2,1-4H3/t19-,23+
Reactome pathway
251n/an/an/an/an/an/an/an/a
Cancer Therapeutics
Curated by ChEMBL
Assay Description
Antagonist activity at human D2 receptor expressed in CHO cells by [35S]GTPgammaS binding assay
Bioorg Med Chem Lett 19: 4799-801 (2009)
Article DOI: 10.1016/j.bmcl.2009.06.043
BindingDB Entry DOI: 10.7270/Q2154J9T
D(2) dopamine receptor
(Homo sapiens (Human))
BDBM50414581
(CHEMBL560270)
Show SMILES CN(CCN1CCN(C1=O)c1cccc(C)c1)C[C@@]12CC[C@@H](CC1)C2(C)C |r|
Show InChI InChI=1S/C23H35N3O/c1-18-6-5-7-20(16-18)26-15-14-25(21(26)27)13-12-24(4)17-23-10-8-19(9-11-23)22(23,2)3/h5-7,16,19H,8-15,17H2,1-4H3/t19-,23+
Reactome pathway
251n/an/an/an/an/an/an/an/a
Imperial College London
Curated by ChEMBL
Assay Description
Binding affinity to human DRD2 receptor by GTPgammaS binding assay
Bioorg Med Chem Lett 19: 5056-9 (2009)
Article DOI: 10.1016/j.bmcl.2009.07.055
BindingDB Entry DOI: 10.7270/Q2PR7X7C
Potassium voltage-gated channel subfamily H member 2
(Homo sapiens (Human))
BDBM50414581
(CHEMBL560270)
Show SMILES CN(CCN1CCN(C1=O)c1cccc(C)c1)C[C@@]12CC[C@@H](CC1)C2(C)C |r|
Show InChI InChI=1S/C23H35N3O/c1-18-6-5-7-20(16-18)26-15-14-25(21(26)27)13-12-24(4)17-23-10-8-19(9-11-23)22(23,2)3/h5-7,16,19H,8-15,17H2,1-4H3/t19-,23+
Reactome pathway
n/an/a 1.58E+3n/an/an/an/an/an/a
Cancer Therapeutics
Curated by ChEMBL
Assay Description
Displacement of [3H]dofetilide from human ERG channel by scintillation proximity assay
Bioorg Med Chem Lett 19: 4799-801 (2009)
Article DOI: 10.1016/j.bmcl.2009.06.043
BindingDB Entry DOI: 10.7270/Q2154J9T
Potassium voltage-gated channel subfamily H member 2
(Homo sapiens (Human))
BDBM50414581
(CHEMBL560270)
Show SMILES CN(CCN1CCN(C1=O)c1cccc(C)c1)C[C@@]12CC[C@@H](CC1)C2(C)C |r|
Show InChI InChI=1S/C23H35N3O/c1-18-6-5-7-20(16-18)26-15-14-25(21(26)27)13-12-24(4)17-23-10-8-19(9-11-23)22(23,2)3/h5-7,16,19H,8-15,17H2,1-4H3/t19-,23+
Reactome pathway
n/an/a 1.58E+3n/an/an/an/an/an/a
Imperial College London
Curated by ChEMBL
Assay Description
Displacement of [3H]dofetilide from human ERG
Bioorg Med Chem Lett 19: 5056-9 (2009)
Article DOI: 10.1016/j.bmcl.2009.07.055
BindingDB Entry DOI: 10.7270/Q2PR7X7C