null
SMILES: CCN(CC(O)(CNc1cccc2n(ncc12)-c1ccc(F)cc1)C(F)(F)F)C(=O)c1c(F)cccc1F
InChI Key: InChIKey=POBPWPMHJQHFCB-UHFFFAOYSA-N
Activity Spreadsheet -- Enzyme Inhibition Constant Data from BindingDB
Found 1 hit for monomerid = 50414605
Trg + Lig
Ki
nM
ΔG°
kcal/mole
IC50
nM
Kd
nM
EC50/IC50
nM
koff
s-1
kon
M-1s-1
pHTemp
°C
Glucocorticoid receptor
(Homo sapiens (Human))
BDBM50414605
(CHEMBL556231)
Show SMILES CCN(CC(O)(CNc1cccc2n(ncc12)-c1ccc(F)cc1)C(F)(F)F)C(=O)c1c(F)cccc1F
Show InChI InChI=1S/C26H22F6N4O2/c1-2-35(24(37)23-19(28)5-3-6-20(23)29)15-25(38,26(30,31)32)14-33-21-7-4-8-22-18(21)13-34-36(22)17-11-9-16(27)10-12-17/h3-13,33,38H,2,14-15H2,1H3
n/an/a 0.316n/an/an/an/an/an/a
GlaxoSmithKline
Curated by ChEMBL
Assay Description
Agonist activity at GR in human A549 cells by NF-kappaB transrepression assay
Bioorg Med Chem Lett 19: 4846-50 (2009)
Article DOI: 10.1016/j.bmcl.2009.06.020
BindingDB Entry DOI: 10.7270/Q2RR20HH