null
SMILES: CCC1(CC(O)(CNC(=O)c2cnn(c2N)-c2ccccc2)C(F)(F)F)CCCc2ccccc12
InChI Key: InChIKey=RDHOUXJDBGOXKP-UHFFFAOYSA-N
Activity Spreadsheet -- Enzyme Inhibition Constant Data from BindingDB
Found 3 hits for monomerid = 50414623
Trg + Lig
Ki
nM
ΔG°
kcal/mole
IC50
nM
Kd
nM
EC50/IC50
nM
koff
s-1
kon
M-1s-1
pHTemp
°C
Glucocorticoid receptor
(Homo sapiens (Human))
BDBM50414623
(CHEMBL394168)
Show SMILES CCC1(CC(O)(CNC(=O)c2cnn(c2N)-c2ccccc2)C(F)(F)F)CCCc2ccccc12
Show InChI InChI=1S/C26H29F3N4O2/c1-2-24(14-8-10-18-9-6-7-13-21(18)24)16-25(35,26(27,28)29)17-31-23(34)20-15-32-33(22(20)30)19-11-4-3-5-12-19/h3-7,9,11-13,15,35H,2,8,10,14,16-17,30H2,1H3,(H,31,34)
n/an/a 7.40n/an/an/an/an/an/a
GlaxoSmithKline
Curated by ChEMBL
Assay Description
Binding affinity to glucocorticoid receptor
Bioorg Med Chem Lett 17: 4737-45 (2007)
Article DOI: 10.1016/j.bmcl.2007.06.066
BindingDB Entry DOI: 10.7270/Q2KD206G
Glucocorticoid receptor
(Homo sapiens (Human))
BDBM50414623
(CHEMBL394168)
Show SMILES CCC1(CC(O)(CNC(=O)c2cnn(c2N)-c2ccccc2)C(F)(F)F)CCCc2ccccc12
Show InChI InChI=1S/C26H29F3N4O2/c1-2-24(14-8-10-18-9-6-7-13-21(18)24)16-25(35,26(27,28)29)17-31-23(34)20-15-32-33(22(20)30)19-11-4-3-5-12-19/h3-7,9,11-13,15,35H,2,8,10,14,16-17,30H2,1H3,(H,31,34)
n/an/a 1.58n/an/an/an/an/an/a
GlaxoSmithKline
Curated by ChEMBL
Assay Description
Agonist activity at GR in human A549 cells by NF-kappaB transrepression assay
Bioorg Med Chem Lett 19: 4846-50 (2009)
Article DOI: 10.1016/j.bmcl.2009.06.020
BindingDB Entry DOI: 10.7270/Q2RR20HH
Glucocorticoid receptor
(Homo sapiens (Human))
BDBM50414623
(CHEMBL394168)
Show SMILES CCC1(CC(O)(CNC(=O)c2cnn(c2N)-c2ccccc2)C(F)(F)F)CCCc2ccccc12
Show InChI InChI=1S/C26H29F3N4O2/c1-2-24(14-8-10-18-9-6-7-13-21(18)24)16-25(35,26(27,28)29)17-31-23(34)20-15-32-33(22(20)30)19-11-4-3-5-12-19/h3-7,9,11-13,15,35H,2,8,10,14,16-17,30H2,1H3,(H,31,34)
n/an/a 1.70n/an/an/an/an/an/a
GlaxoSmithKline
Curated by ChEMBL
Assay Description
Agonist activity at glucocorticoid receptor in human A549 cells by NF-kappaB transrepression assay
Bioorg Med Chem Lett 17: 4737-45 (2007)
Article DOI: 10.1016/j.bmcl.2007.06.066
BindingDB Entry DOI: 10.7270/Q2KD206G