BDBM50414624 CHEMBL560736
SMILES: Cn1cc(cn1)-c1cccc(CC(NC(=O)c2ccccc2)C(=O)NCC#N)c1
InChI Key: InChIKey=VSNZDNFCCVCSSH-UHFFFAOYSA-N
Data: 5 IC50
Activity Spreadsheet -- Enzyme Inhibition Constant Data from BindingDB
Found 5 hits for monomerid = 50414624
Trg + Lig
Ki
nM
ΔG°
kcal/mole
IC50
nM
Kd
nM
EC50/IC50
nM
koff
s-1
kon
M-1s-1
pHTemp
°C
Procathepsin L
(Homo sapiens (Human))
BDBM50414624
(CHEMBL560736)
Show SMILES Cn1cc(cn1)-c1cccc(CC(NC(=O)c2ccccc2)C(=O)NCC#N)c1
Show InChI InChI=1S/C22H21N5O2/c1-27-15-19(14-25-27)18-9-5-6-16(12-18)13-20(22(29)24-11-10-23)26-21(28)17-7-3-2-4-8-17/h2-9,12,14-15,20H,11,13H2,1H3,(H,24,29)(H,26,28)
Reactome pathway
n/an/a 501n/an/an/an/an/an/a
AstraZeneca
Curated by ChEMBL
Assay Description
Inhibition of cathepsin L assessed as inhibition of fluorogenic substrate cleavage
Bioorg Med Chem Lett 19: 4622-5 (2009)
Article DOI: 10.1016/j.bmcl.2009.06.090
BindingDB Entry DOI: 10.7270/Q2N017S3
Cathepsin L2
(Homo sapiens (Human))
BDBM50414624
(CHEMBL560736)
Show SMILES Cn1cc(cn1)-c1cccc(CC(NC(=O)c2ccccc2)C(=O)NCC#N)c1
Show InChI InChI=1S/C22H21N5O2/c1-27-15-19(14-25-27)18-9-5-6-16(12-18)13-20(22(29)24-11-10-23)26-21(28)17-7-3-2-4-8-17/h2-9,12,14-15,20H,11,13H2,1H3,(H,24,29)(H,26,28)
n/an/a 1.58E+3n/an/an/an/an/an/a
AstraZeneca
Curated by ChEMBL
Assay Description
Inhibition of cathepsin L2 assessed as inhibition of fluorogenic substrate cleavage
Bioorg Med Chem Lett 19: 4622-5 (2009)
Article DOI: 10.1016/j.bmcl.2009.06.090
BindingDB Entry DOI: 10.7270/Q2N017S3
Cathepsin S
(Homo sapiens (Human))
BDBM50414624
(CHEMBL560736)
Show SMILES Cn1cc(cn1)-c1cccc(CC(NC(=O)c2ccccc2)C(=O)NCC#N)c1
Show InChI InChI=1S/C22H21N5O2/c1-27-15-19(14-25-27)18-9-5-6-16(12-18)13-20(22(29)24-11-10-23)26-21(28)17-7-3-2-4-8-17/h2-9,12,14-15,20H,11,13H2,1H3,(H,24,29)(H,26,28)
Reactome pathway
n/an/a 100n/an/an/an/an/an/a
AstraZeneca
Curated by ChEMBL
Assay Description
Inhibition of cathepsin S assessed as inhibition of fluorogenic substrate cleavage
Bioorg Med Chem Lett 19: 4622-5 (2009)
Article DOI: 10.1016/j.bmcl.2009.06.090
BindingDB Entry DOI: 10.7270/Q2N017S3
Cathepsin K
(Homo sapiens (Human))
BDBM50414624
(CHEMBL560736)
Show SMILES Cn1cc(cn1)-c1cccc(CC(NC(=O)c2ccccc2)C(=O)NCC#N)c1
Show InChI InChI=1S/C22H21N5O2/c1-27-15-19(14-25-27)18-9-5-6-16(12-18)13-20(22(29)24-11-10-23)26-21(28)17-7-3-2-4-8-17/h2-9,12,14-15,20H,11,13H2,1H3,(H,24,29)(H,26,28)
Reactome pathway
n/an/a>1.00E+4n/an/an/an/an/an/a
AstraZeneca
Curated by ChEMBL
Assay Description
Inhibition of cathepsin K assessed as inhibition of fluorogenic substrate cleavage
Bioorg Med Chem Lett 19: 4622-5 (2009)
Article DOI: 10.1016/j.bmcl.2009.06.090
BindingDB Entry DOI: 10.7270/Q2N017S3
Cathepsin B
(Homo sapiens (Human))
BDBM50414624
(CHEMBL560736)
Show SMILES Cn1cc(cn1)-c1cccc(CC(NC(=O)c2ccccc2)C(=O)NCC#N)c1
Show InChI InChI=1S/C22H21N5O2/c1-27-15-19(14-25-27)18-9-5-6-16(12-18)13-20(22(29)24-11-10-23)26-21(28)17-7-3-2-4-8-17/h2-9,12,14-15,20H,11,13H2,1H3,(H,24,29)(H,26,28)
Reactome pathway
n/an/a 6.31E+3n/an/an/an/an/an/a
AstraZeneca
Curated by ChEMBL
Assay Description
Inhibition of human liver cathepsin B assessed as inhibition of fluorogenic substrate cleavage
Bioorg Med Chem Lett 19: 4622-5 (2009)
Article DOI: 10.1016/j.bmcl.2009.06.090
BindingDB Entry DOI: 10.7270/Q2N017S3