BDBM50414714 CHEMBL556326
SMILES: [H][C@@]12CC[C@]([H])(CC(C1)NC(=O)c1cc3ccccc3n(C(C)C)c1=O)N2CCCCCCCCN1CCN(CC1)S(C)(=O)=O
InChI Key: InChIKey=KAOSIRKPPAYQML-FQLXRVMXSA-N
Data: 1 KI  1 EC50
Activity Spreadsheet -- Enzyme Inhibition Constant Data from BindingDB
Found 2 hits for monomerid = 50414714
Trg + Lig
Ki
nM
ΔG°
kcal/mole
IC50
nM
Kd
nM
EC50/IC50
nM
koff
s-1
kon
M-1s-1
pHTemp
°C
5-hydroxytryptamine receptor 4 (5-HT4)
(Homo sapiens (Human))
BDBM50414714
(CHEMBL556326)
Show SMILES [H][C@@]12CC[C@]([H])(CC(C1)NC(=O)c1cc3ccccc3n(C(C)C)c1=O)N2CCCCCCCCN1CCN(CC1)S(C)(=O)=O |r|
Show InChI InChI=1S/C33H51N5O4S/c1-25(2)38-31-13-9-8-12-26(31)22-30(33(38)40)32(39)34-27-23-28-14-15-29(24-27)37(28)17-11-7-5-4-6-10-16-35-18-20-36(21-19-35)43(3,41)42/h8-9,12-13,22,25,27-29H,4-7,10-11,14-21,23-24H2,1-3H3,(H,34,39)/t28-,29-/m1/s1
15.8n/an/an/an/an/an/an/an/a
Theravance, Inc.
Curated by ChEMBL
Assay Description
Displacement of [H]GR-113808 from human 5HT4C receptor expressed in HEK293 cells by liquid scintillation counting
J Med Chem 52: 5330-43 (2009)
Article DOI: 10.1021/jm900881j
BindingDB Entry DOI: 10.7270/Q2CF9RBH
5-hydroxytryptamine receptor 4 (5-HT4)
(Homo sapiens (Human))
BDBM50414714
(CHEMBL556326)
Show SMILES [H][C@@]12CC[C@]([H])(CC(C1)NC(=O)c1cc3ccccc3n(C(C)C)c1=O)N2CCCCCCCCN1CCN(CC1)S(C)(=O)=O |r|
Show InChI InChI=1S/C33H51N5O4S/c1-25(2)38-31-13-9-8-12-26(31)22-30(33(38)40)32(39)34-27-23-28-14-15-29(24-27)37(28)17-11-7-5-4-6-10-16-35-18-20-36(21-19-35)43(3,41)42/h8-9,12-13,22,25,27-29H,4-7,10-11,14-21,23-24H2,1-3H3,(H,34,39)/t28-,29-/m1/s1
n/an/an/an/a 3.16n/an/an/an/a
Theravance, Inc.
Curated by ChEMBL
Assay Description
Agonist activity at human 5HT4C receptor expressed in HEK293 cells assessed as acumulation of cAMP by flash plate adenylyl cyclase activation assay
J Med Chem 52: 5330-43 (2009)
Article DOI: 10.1021/jm900881j
BindingDB Entry DOI: 10.7270/Q2CF9RBH