BDBM50414728 CHEMBL559322
SMILES: [H][C@]12CC[C@]([H])(C[C@@H](C1)NC(=O)c1cc3ccccc3n(C(C)C)c1=O)N2CCCCCCCN1CCOCC1
InChI Key: InChIKey=BLFYXJBXIJKCKD-LGKQTMLJSA-N
Data: 1 KI  1 EC50
Activity Spreadsheet -- Enzyme Inhibition Constant Data from BindingDB
Found 2 hits for monomerid = 50414728
Trg + Lig
Ki
nM
ΔG°
kcal/mole
IC50
nM
Kd
nM
EC50/IC50
nM
koff
s-1
kon
M-1s-1
pHTemp
°C
5-hydroxytryptamine receptor 4 (5-HT4)
(Homo sapiens (Human))
BDBM50414728
(CHEMBL559322)
Show SMILES [H][C@]12CC[C@]([H])(C[C@@H](C1)NC(=O)c1cc3ccccc3n(C(C)C)c1=O)N2CCCCCCCN1CCOCC1 |r|
Show InChI InChI=1S/C31H46N4O3/c1-23(2)35-29-11-7-6-10-24(29)20-28(31(35)37)30(36)32-25-21-26-12-13-27(22-25)34(26)15-9-5-3-4-8-14-33-16-18-38-19-17-33/h6-7,10-11,20,23,25-27H,3-5,8-9,12-19,21-22H2,1-2H3,(H,32,36)/t25-,26+,27-
2n/an/an/an/an/an/an/an/a
Theravance, Inc.
Curated by ChEMBL
Assay Description
Displacement of [H]GR-113808 from human 5HT4C receptor expressed in HEK293 cells by liquid scintillation counting
J Med Chem 52: 5330-43 (2009)
Article DOI: 10.1021/jm900881j
BindingDB Entry DOI: 10.7270/Q2CF9RBH
5-hydroxytryptamine receptor 4 (5-HT4)
(Homo sapiens (Human))
BDBM50414728
(CHEMBL559322)
Show SMILES [H][C@]12CC[C@]([H])(C[C@@H](C1)NC(=O)c1cc3ccccc3n(C(C)C)c1=O)N2CCCCCCCN1CCOCC1 |r|
Show InChI InChI=1S/C31H46N4O3/c1-23(2)35-29-11-7-6-10-24(29)20-28(31(35)37)30(36)32-25-21-26-12-13-27(22-25)34(26)15-9-5-3-4-8-14-33-16-18-38-19-17-33/h6-7,10-11,20,23,25-27H,3-5,8-9,12-19,21-22H2,1-2H3,(H,32,36)/t25-,26+,27-
n/an/an/an/a 2.51n/an/an/an/a
Theravance, Inc.
Curated by ChEMBL
Assay Description
Agonist activity at human 5HT4C receptor expressed in HEK293 cells assessed as acumulation of cAMP by flash plate adenylyl cyclase activation assay
J Med Chem 52: 5330-43 (2009)
Article DOI: 10.1021/jm900881j
BindingDB Entry DOI: 10.7270/Q2CF9RBH