BDBM50414731 CHEMBL555222
SMILES: [H][C@]12CC[C@]([H])(C[C@@H](C1)NC(=O)c1cc3ccccc3n(C(C)C)c1=O)N2CCCN1CCN(CC1)c1ccccc1
InChI Key: InChIKey=YELQSMXPCPMVON-RHKQRFKBSA-N
Data: 1 KI  1 EC50
Activity Spreadsheet -- Enzyme Inhibition Constant Data from BindingDB
Found 2 hits for monomerid = 50414731
Trg + Lig
Ki
nM
ΔG°
kcal/mole
IC50
nM
Kd
nM
EC50/IC50
nM
koff
s-1
kon
M-1s-1
pHTemp
°C
5-hydroxytryptamine receptor 4 (5-HT4)
(Homo sapiens (Human))
BDBM50414731
(CHEMBL555222)
Show SMILES [H][C@]12CC[C@]([H])(C[C@@H](C1)NC(=O)c1cc3ccccc3n(C(C)C)c1=O)N2CCCN1CCN(CC1)c1ccccc1 |r|
Show InChI InChI=1S/C33H43N5O2/c1-24(2)38-31-12-7-6-9-25(31)21-30(33(38)40)32(39)34-26-22-28-13-14-29(23-26)37(28)16-8-15-35-17-19-36(20-18-35)27-10-4-3-5-11-27/h3-7,9-12,21,24,26,28-29H,8,13-20,22-23H2,1-2H3,(H,34,39)/t26-,28+,29-
7.94n/an/an/an/an/an/an/an/a
Theravance, Inc.
Curated by ChEMBL
Assay Description
Displacement of [H]GR-113808 from human 5HT4C receptor expressed in HEK293 cells by liquid scintillation counting
J Med Chem 52: 5330-43 (2009)
Article DOI: 10.1021/jm900881j
BindingDB Entry DOI: 10.7270/Q2CF9RBH
5-hydroxytryptamine receptor 4 (5-HT4)
(Homo sapiens (Human))
BDBM50414731
(CHEMBL555222)
Show SMILES [H][C@]12CC[C@]([H])(C[C@@H](C1)NC(=O)c1cc3ccccc3n(C(C)C)c1=O)N2CCCN1CCN(CC1)c1ccccc1 |r|
Show InChI InChI=1S/C33H43N5O2/c1-24(2)38-31-12-7-6-9-25(31)21-30(33(38)40)32(39)34-26-22-28-13-14-29(23-26)37(28)16-8-15-35-17-19-36(20-18-35)27-10-4-3-5-11-27/h3-7,9-12,21,24,26,28-29H,8,13-20,22-23H2,1-2H3,(H,34,39)/t26-,28+,29-
n/an/an/an/a 0.794n/an/an/an/a
Theravance, Inc.
Curated by ChEMBL
Assay Description
Agonist activity at human 5HT4C receptor expressed in HEK293 cells assessed as acumulation of cAMP by flash plate adenylyl cyclase activation assay
J Med Chem 52: 5330-43 (2009)
Article DOI: 10.1021/jm900881j
BindingDB Entry DOI: 10.7270/Q2CF9RBH