BDBM50414732 CHEMBL539651
SMILES: [H][C@]12CC[C@]([H])(C[C@@H](C1)NC(=O)c1cc3ccccc3n(C(C)C)c1=O)N2CCCCCCCN1CCN(CC1)c1ccccc1
InChI Key: InChIKey=OTWJCQNGXQUBEK-IFBCEJQISA-N
Data: 1 KI  1 EC50
Activity Spreadsheet -- Enzyme Inhibition Constant Data from BindingDB
Found 2 hits for monomerid = 50414732
Trg + Lig
Ki
nM
ΔG°
kcal/mole
IC50
nM
Kd
nM
EC50/IC50
nM
koff
s-1
kon
M-1s-1
pHTemp
°C
5-hydroxytryptamine receptor 4 (5-HT4)
(Homo sapiens (Human))
BDBM50414732
(CHEMBL539651)
Show SMILES [H][C@]12CC[C@]([H])(C[C@@H](C1)NC(=O)c1cc3ccccc3n(C(C)C)c1=O)N2CCCCCCCN1CCN(CC1)c1ccccc1 |r|
Show InChI InChI=1S/C37H51N5O2/c1-28(2)42-35-16-10-9-13-29(35)25-34(37(42)44)36(43)38-30-26-32-17-18-33(27-30)41(32)20-12-5-3-4-11-19-39-21-23-40(24-22-39)31-14-7-6-8-15-31/h6-10,13-16,25,28,30,32-33H,3-5,11-12,17-24,26-27H2,1-2H3,(H,38,43)/t30-,32+,33-
3.98n/an/an/an/an/an/an/an/a
Theravance, Inc.
Curated by ChEMBL
Assay Description
Displacement of [H]GR-113808 from human 5HT4C receptor expressed in HEK293 cells by liquid scintillation counting
J Med Chem 52: 5330-43 (2009)
Article DOI: 10.1021/jm900881j
BindingDB Entry DOI: 10.7270/Q2CF9RBH
5-hydroxytryptamine receptor 4 (5-HT4)
(Homo sapiens (Human))
BDBM50414732
(CHEMBL539651)
Show SMILES [H][C@]12CC[C@]([H])(C[C@@H](C1)NC(=O)c1cc3ccccc3n(C(C)C)c1=O)N2CCCCCCCN1CCN(CC1)c1ccccc1 |r|
Show InChI InChI=1S/C37H51N5O2/c1-28(2)42-35-16-10-9-13-29(35)25-34(37(42)44)36(43)38-30-26-32-17-18-33(27-30)41(32)20-12-5-3-4-11-19-39-21-23-40(24-22-39)31-14-7-6-8-15-31/h6-10,13-16,25,28,30,32-33H,3-5,11-12,17-24,26-27H2,1-2H3,(H,38,43)/t30-,32+,33-
n/an/an/an/a 7.94n/an/an/an/a
Theravance, Inc.
Curated by ChEMBL
Assay Description
Agonist activity at human 5HT4C receptor expressed in HEK293 cells assessed as acumulation of cAMP by flash plate adenylyl cyclase activation assay
J Med Chem 52: 5330-43 (2009)
Article DOI: 10.1021/jm900881j
BindingDB Entry DOI: 10.7270/Q2CF9RBH