BDBM50414856 CHEMBL573519
SMILES: [#6]-n1c(-[#6]=[#7]\[#7]=[#6](\[#7])-[#7])ccc1-c1ccccc1C(F)(F)F
InChI Key: InChIKey=HKEJLKAGICIRCY-UHFFFAOYSA-N
Data: 2 EC50
Activity Spreadsheet -- Enzyme Inhibition Constant Data from BindingDB
Found 2 hits for monomerid = 50414856
Trg + Lig
Ki
nM
ΔG°
kcal/mole
IC50
nM
Kd
nM
EC50/IC50
nM
koff
s-1
kon
M-1s-1
pHTemp
°C
Neuropeptide FF receptor 1
(Homo sapiens (Human))
BDBM50414856
(CHEMBL573519)
Show SMILES [#6]-n1c(-[#6]=[#7]\[#7]=[#6](\[#7])-[#7])ccc1-c1ccccc1C(F)(F)F |w:3.2|
Show InChI InChI=1S/C14H14F3N5/c1-22-9(8-20-21-13(18)19)6-7-12(22)10-4-2-3-5-11(10)14(15,16)17/h2-8H,1H3,(H4,18,19,21)
Reactome pathway
n/an/an/an/a 316n/an/an/an/a
ACADIA Pharmaceuticals AB
Curated by ChEMBL
Assay Description
Agonist activity at human NPFF1 receptor expressed in cells assessed as beta-galactosidase levels after 5 days
J Med Chem 52: 6511-4 (2009)
Article DOI: 10.1021/jm9011998
BindingDB Entry DOI: 10.7270/Q2G73FZF
NPFF2
(Homo sapiens (Human))
BDBM50414856
(CHEMBL573519)
Show SMILES [#6]-n1c(-[#6]=[#7]\[#7]=[#6](\[#7])-[#7])ccc1-c1ccccc1C(F)(F)F |w:3.2|
Show InChI InChI=1S/C14H14F3N5/c1-22-9(8-20-21-13(18)19)6-7-12(22)10-4-2-3-5-11(10)14(15,16)17/h2-8H,1H3,(H4,18,19,21)
n/an/an/an/a 126n/an/an/an/a
ACADIA Pharmaceuticals AB
Curated by ChEMBL
Assay Description
Agonist activity at human NPFF2 receptor expressed in cells assessed as beta-galactosidase levels after 5 days
J Med Chem 52: 6511-4 (2009)
Article DOI: 10.1021/jm9011998
BindingDB Entry DOI: 10.7270/Q2G73FZF