BDBM50414869 CHEMBL566755
SMILES: COc1cc2CCc3c(NCc4c(Cl)cccc4Cl)[nH]nc3-c2cc1OC
InChI Key: InChIKey=VBNISAQFHUFNMA-UHFFFAOYSA-N
Data: 1 IC50
Activity Spreadsheet -- Enzyme Inhibition Constant Data from BindingDB
Found 1 hit for monomerid = 50414869
Trg + Lig
Ki
nM
ΔG°
kcal/mole
IC50
nM
Kd
nM
EC50/IC50
nM
koff
s-1
kon
M-1s-1
pHTemp
°C
Eukaryotic translation initiation factor 2-alpha kinase 1
(Homo sapiens (Human))
BDBM50414869
(CHEMBL566755)
Show SMILES COc1cc2CCc3c(NCc4c(Cl)cccc4Cl)[nH]nc3-c2cc1OC
Show InChI InChI=1S/C20H19Cl2N3O2/c1-26-17-8-11-6-7-12-19(13(11)9-18(17)27-2)24-25-20(12)23-10-14-15(21)4-3-5-16(14)22/h3-5,8-9H,6-7,10H2,1-2H3,(H2,23,24,25)
n/an/a>1.00E+4n/an/an/an/an/an/a
Johnson& Johnson Pharmaceutical Research and Development
Curated by ChEMBL
Assay Description
Inhibition of human HRI kinase
Bioorg Med Chem Lett 19: 6548-51 (2009)
Article DOI: 10.1016/j.bmcl.2009.10.033
BindingDB Entry DOI: 10.7270/Q26Q1ZGZ