BDBM50414885 CHEMBL574009
SMILES: CN(C)c1ccc2Cc3c(NCc4c(C)cccc4Cl)[nH]nc3-c2c1
InChI Key: InChIKey=IVLPSCXTSWEOQX-UHFFFAOYSA-N
Data: 1 IC50
Activity Spreadsheet -- Enzyme Inhibition Constant Data from BindingDB
Found 1 hit for monomerid = 50414885
Trg + Lig
Ki
nM
ΔG°
kcal/mole
IC50
nM
Kd
nM
EC50/IC50
nM
koff
s-1
kon
M-1s-1
pHTemp
°C
Eukaryotic translation initiation factor 2-alpha kinase 1
(Homo sapiens (Human))
BDBM50414885
(CHEMBL574009)
Show SMILES CN(C)c1ccc2Cc3c(NCc4c(C)cccc4Cl)[nH]nc3-c2c1
Show InChI InChI=1S/C20H21ClN4/c1-12-5-4-6-18(21)17(12)11-22-20-16-9-13-7-8-14(25(2)3)10-15(13)19(16)23-24-20/h4-8,10H,9,11H2,1-3H3,(H2,22,23,24)
n/an/a 251n/an/an/an/an/an/a
Johnson& Johnson Pharmaceutical Research and Development
Curated by ChEMBL
Assay Description
Inhibition of human HRI kinase
Bioorg Med Chem Lett 19: 6548-51 (2009)
Article DOI: 10.1016/j.bmcl.2009.10.033
BindingDB Entry DOI: 10.7270/Q26Q1ZGZ